{"text_format":"1","workbook":"xlsx","n_sheets":10,"sheets":["Börja här","Resultat Hållbarhet","Ekonomi","Miljö","Material","Uppvärmning","Trp","Calc","Socialt","Defaultvärden"],"not_rendered":{"charts":10,"images":15,"macros":1,"external_links":2,"defined_names":190,"comments":3,"pivot_tables":0},"unopened":[],"bounds":{"document_bytes":16777216,"sheet_cells":100000,"rows_first":2000,"rows_last":500,"rows_between":2000,"halvings":0,"cell_chars":16384,"cell_head_chars":4096},"cells_cut":0,"cells_raw":0,"read":"whole","date_system":"1900"}

{"sheet":"Börja här","index":0,"n_rows":28,"n_cols":17,"rows_kept":28,"cut":false,"hidden":false,"merged":[[18,0,18,11],[23,0,23,11],[10,0,10,11],[26,17,26,18],[27,17,27,18],[24,17,24,18],[25,17,25,18],[18,17,18,18],[19,17,19,18],[20,17,20,18],[21,17,21,18],[22,17,22,18],[23,17,23,18],[11,0,12,10],[16,0,16,10],[17,0,17,11]]}
[null,null,null,null,"Jämför hållbarhet mellan olika renoveringsalternativ"]
["Detta är ett verktyg för utvärdering av hållbarhet vid renovering av fastigheter. "]
["Verktyget har utvecklats av RISE Research Institutes of Sweden. Användare ansvarar för indata."]
[]
["Version:",null,"Renobuild Skola 3.0 - anpassat för hållbarhetsutvärdering vid renovering av skolor."]
["Senast uppdaterat:",null,"2018-04-06"]
["Utförlig användarmanual och ytterligare information finns på www.renobuild.se."]
[]
["Så här fungerar det:"]
[]
["1. Definiera ett antal alternativ, som vart och ett kan bestå av en eller flera renoveringsåtgärder. Alternativ 1  måste vara reserverat för ett referensfall, som kan vara antingen att ingen renovering genomförs eller ett minimialternativ där nödvändiga åtgärder som förekommer i alla alternativ ingår. Dock kan kostnader för underhåll m.m. påföras. Sociala konsekvenser av detta kan också utredas.",null,null,null,null,null,null,null,null,null,null,null,null,null,null,null,"Projektinformation"]
["2. Ange grundläggande projektinformation i dialogrutan med hjälp av knappen nedan.",null,null,null,null,null,null,null,null,null,null,null,null,null,null,null,"Projektnamn:"]
[null,null,null,null,null,null,null,null,null,null,null,null,null,null,null,null,"Projektledare:"]
[null,null,null,null,null,null,null,null,null,null,null,null,null,null,null,null,"Datum:"]
[null,null,null,null,null,null,null,null,null,null,null,null,null,null,null,null,"Antal alternativ:"]
[null,null,null,null,null,null,null,null,null,null,null,null,null,null,null,null,"Beräkningsperiod:"]
["3. Namnge gärna alternativen i tabellen till höger."]
["4. Samla in data om de alterantiv som ska jämföras. I respektive indataflik nedan förklaras närmare vilken indata som behövs."]
["5. Genomför analyser av respektive hållbarhetsaspekt.",null,null,null,null,null,null,null,null,null,null,null,null,null,null,null,"Referensfall"]
[null,null,null,null,null,null,null,null,null,null,null,null,null,null,null,null,{"$f":"IF($R$15>1,\"Alt. 2\",\"\")","v":""}]
[null,null,null,null,null,null,null,null,null,null,null,null,null,null,null,null,{"$f":"IF($R$15>2,\"Alt. 3\",\"\")","v":""}]
[null,null,null,null,null,null,null,null,null,null,null,null,null,null,null,null,{"$f":"IF($R$15>3,\"Alt. 4\",\"\")","v":""}]
[null,null,null,null,null,null,null,null,null,null,null,null,null,null,null,null,{"$f":"IF($R$15>4,\"Alt. 5\",\"\")","v":""}]
["6. Studera resultat och justera alternativ efter behov.",null,null,null,null,null,null,null,null,null,null,null,null,null,null,null,{"$f":"IF($R$15>5,\"Alt. 6\",\"\")","v":""}]
[null,null,null,null,null,null,null,null,null,null,null,null,null,null,null,null,{"$f":"IF($R$15>6,\"Alt. 7\",\"\")","v":""}]
[null,null,null,null,null,null,null,null,null,null,null,null,null,null,null,null,{"$f":"IF($R$15>7,\"Alt. 8\",\"\")","v":""}]
[null,null,null,null,null,null,null,null,null,null,null,null,null,null,null,null,{"$f":"IF($R$15>8,\"Alt. 9\",\"\")","v":""}]
[null,null,null,null,null,null,null,null,null,null,null,null,null,null,null,null,{"$f":"IF($R$15>9,\"Alt. 10\",\"\")","v":""}]

{"sheet":"Resultat Hållbarhet","index":1,"n_rows":24,"n_cols":12,"rows_kept":24,"cut":false,"hidden":false,"merged":[[3,0,3,9],[23,0,23,1],[14,0,14,1],[15,0,15,1],[13,0,13,1],[17,0,17,1],[22,0,22,1],[21,0,21,1],[19,0,19,1],[18,0,18,1],[6,1,6,2],[7,1,7,2],[8,1,8,2],[8,8,8,9],[8,4,8,7]]}
[null,null,null,"Resultat av hållbarhetsutvärdering"]
["I detta blad sammanfattas resultaten från de tre flikarna Ekonomi, Miljö och Socialt."]
["Här jämförs de olika renoveringsalternativen. Resultaten från flikerna Ekonomi, Miljö och Socialt är samlade i den här sidan, graderade enligt en procentskala och representerade i ett diagram. "]
["Det alternativ med bäst värde på varje del värderas som 100% för Socialt och Miljö. Skalan i Ekonomi går från 100% (dyrast) to 1% (0 kronor). Bollarnas storlek i diagrammet är proportionella mot procentvärdet för Ekonomi: en mindre boll betyder att alternativet har lägre livscykelkostnad än en större. Sammanfattningsvis skulle en liten boll långt upp till höger i diagrammet vara det bästa alternativet."]
[]
["Projektinformation"]
["Projektnamn",{"$f":"IF('Börja här'!R12=\"\",\"\",'Börja här'!R12)","v":""}]
["Ansvarig",{"$f":"IF('Börja här'!R13=\"\",\"\",'Börja här'!R13)","v":""}]
["Datum",{"$f":"IF('Börja här'!R14=\"\",\"\",'Börja här'!R14)","v":""}]
["Beräkningsperiod",{"$f":"IF('Börja här'!R16=\"\",\"\",'Börja här'!R16)","v":""}]
[]
["Resultat",null,{"$f":"IF('Börja här'!Q19=\"\",\"\",'Börja här'!Q19)","v":"Referensfall"},{"$f":"IF('Börja här'!Q20=\"\",\"\",'Börja här'!Q20)","v":""},{"$f":"IF('Börja här'!Q21=\"\",\"\",'Börja här'!Q21)","v":""},{"$f":"IF('Börja här'!Q22=\"\",\"\",'Börja här'!Q22)","v":""},{"$f":"IF('Börja här'!Q23=\"\",\"\",'Börja här'!Q23)","v":""},{"$f":"IF('Börja här'!Q24=\"\",\"\",'Börja här'!Q24)","v":""},{"$f":"IF('Börja här'!Q25=\"\",\"\",'Börja här'!Q25)","v":""},{"$f":"IF('Börja här'!Q26=\"\",\"\",'Börja här'!Q26)","v":""},{"$f":"IF('Börja här'!R26=\"\",\"\",'Börja här'!R26)","v":""},{"$f":"IF('Börja här'!S26=\"\",\"\",'Börja här'!S26)","v":""}]
["Beskrivning",null,{"$f":"IF('Börja här'!R19=\"\",\"\",'Börja här'!R19)","v":""},{"$f":"IF('Börja här'!R20=\"\",\"\",'Börja här'!R20)","v":""},{"$f":"IF('Börja här'!R21=\"\",\"\",'Börja här'!R21)","v":""},{"$f":"IF('Börja här'!R22=\"\",\"\",'Börja här'!R22)","v":""},{"$f":"IF('Börja här'!R23=\"\",\"\",'Börja här'!R23)","v":""},{"$f":"IF('Börja här'!R24=\"\",\"\",'Börja här'!R24)","v":""},{"$f":"IF('Börja här'!R25=\"\",\"\",'Börja här'!R25)","v":""},{"$f":"IF('Börja här'!R26=\"\",\"\",'Börja här'!R26)","v":""},{"$f":"IF('Börja här'!R27=\"\",\"\",'Börja här'!R27)","v":""},{"$f":"IF('Börja här'!R28=\"\",\"\",'Börja här'!R28)","v":""}]
["Ekonomi"]
["kr",null,null,{"$f":"IF(Ekonomi!F31=0, \"\",Ekonomi!F31)","v":{"$error":"#VALUE!"}},{"$f":"IF(Ekonomi!G31=0, \"\", Ekonomi!G31)","v":{"$error":"#VALUE!"}},{"$f":"IF(Ekonomi!H31=0, \"\",Ekonomi!H31)","v":{"$error":"#VALUE!"}},{"$f":"IF(Ekonomi!I31=0, \"\", Ekonomi!I31)","v":{"$error":"#VALUE!"}},{"$f":"IF(Ekonomi!J31=0, \"\", Ekonomi!J31)","v":{"$error":"#VALUE!"}},{"$f":"IF(Ekonomi!K31=0, \"\", Ekonomi!K31)","v":{"$error":"#VALUE!"}},{"$f":"IF(Ekonomi!L31=0, \"\", Ekonomi!L31)","v":{"$error":"#VALUE!"}},{"$f":"IF(Ekonomi!M31=0, \"\", Ekonomi!M31)","v":{"$error":"#VALUE!"}},{"$f":"IF(Ekonomi!N31=0, \"\", Ekonomi!N31)","v":{"$error":"#VALUE!"}}]
["%",null,{"$f":"IF(C15=\"\",\"\",IF(C15/(MAX($C$15:$L$15))=0,0.01,((C15/(MAX($C$15:$L$15))))))","v":""},{"$f":"IF(D15=\"\",\"\",IF(D15/(MAX($C$15:$L$15))=0,0.01,((D15/(MAX($C$15:$L$15))))))","v":{"$error":"#VALUE!"}},{"$error":"#VALUE!"},{"$error":"#VALUE!"},{"$error":"#VALUE!"},{"$error":"#VALUE!"},{"$error":"#VALUE!"},{"$error":"#VALUE!"},{"$f":"IF(K15=\"\",\"\",IF(K15/(MAX($C$15:$L$15))=0,0.01,((K15/(MAX($C$15:$L$15))))))","v":{"$error":"#VALUE!"}},{"$f":"IF(L15=\"\",\"\",IF(L15/(MAX($C$15:$L$15))=0,0.01,((L15/(MAX($C$15:$L$15))))))","v":{"$error":"#VALUE!"}}]
[]
["Miljö"]
["CO2-ekv",null,{"$f":"IF(Miljö!C30=0,\"\",Miljö!C30)","v":""},{"$f":"IF(Miljö!D30=0,\"\",Miljö!D30)","v":""},{"$f":"IF(Miljö!E30=0,\"\",Miljö!E30)","v":""},{"$f":"IF(Miljö!F30=0,\"\",Miljö!F30)","v":""},{"$f":"IF(Miljö!G30=0,\"\",Miljö!G30)","v":""},{"$f":"IF(Miljö!H30=0,\"\",Miljö!H30)","v":""},{"$f":"IF(Miljö!I30=0,\"\",Miljö!I30)","v":""},{"$f":"IF(Miljö!J30=0,\"\",Miljö!J30)","v":""},{"$f":"IF(Miljö!K30=0,\"\",Miljö!K30)","v":""},{"$f":"IF(Miljö!L30=0,\"\",Miljö!L30)","v":""}]
["%",null,{"$f":"IF(C19=\"\",\"\",IF(1-(C19-MIN($C$19:$L$19))/(0-MIN($C$19:$L$19))=0,0.01,(1-(C19-MIN($C$19:$L$19))/(0-MIN($C$19:$L$19)))))","v":""},{"$f":"IF(D19=\"\",\"\",IF(1-(D19-MIN($C$19:$L$19))/(0-MIN($C$19:$L$19))=0,0.01,(1-(D19-MIN($C$19:$L$19))/(0-MIN($C$19:$L$19)))))","v":""},"","","","","","","",""]
[]
["Socialt"]
["Poäng",null,{"$f":"IF(Socialt!E32=0,\"\",Socialt!E32)","v":-15},{"$f":"IF(Socialt!F32=0,\"\",Socialt!F32)","v":""},{"$f":"IF(Socialt!G32=0,\"\",Socialt!G32)","v":""},{"$f":"IF(Socialt!H32=0,\"\",Socialt!H32)","v":""},{"$f":"IF(Socialt!I32=0,\"\",Socialt!I32)","v":""},{"$f":"IF(Socialt!J32=0,\"\",Socialt!J32)","v":""},{"$f":"IF(Socialt!K32=0,\"\",Socialt!K32)","v":""},{"$f":"IF(Socialt!L32=0,\"\",Socialt!L32)","v":""},{"$f":"IF(Socialt!M32=0,\"\",Socialt!M32)","v":""},{"$f":"IF(Socialt!N32=0,\"\",Socialt!N32)","v":""}]
["%",null,{"$f":"IF(C23=\"\",\"\",IF((C23+15)/(MAX($C$23:$J$23)+15)=0,0.01,((C23+15)/(MAX($C$23:$J$23)+15))))","v":{"$error":"#DIV/0!"}},{"$f":"IF(D23=\"\",\"\",IF((D23+15)/(MAX($C$23:$J$23)+15)=0,0.01,((D23+15)/(MAX($C$23:$J$23)+15))))","v":""},"","","","","","","",""]

{"sheet":"Ekonomi","index":2,"n_rows":138,"n_cols":14,"rows_kept":138,"cut":false,"hidden":false,"merged":[[20,11,20,16],[11,11,11,16],[12,11,12,16],[13,11,13,16],[14,11,14,16],[15,11,15,16],[16,11,16,16],[17,11,17,16],[18,11,18,16],[19,11,19,16]]}
[null,null,null,null,"Ekonomisk analys"]
["Detta blad används för kostnadsutvärdering i livscykelperspektiv."]
[]
["Så här fungerar det:"]
[]
["Ange indata i de gröna fälten."]
["Extra förklaringar finns i vissa fall i kommentarsfält (röd triangel i höger hörn)."]
[]
[]
["1. Grundförutsättningar",null,null,null,null,null,null,null,null,"1.3 Kort beskrivning av alternativen"]
["1.1 Grunddata",null,null,null,null,null,null,null,null,"Alt. nummer",null,"Beskrivning"]
["LCC-period för investering",null,null,"år",{"$f":"'Resultat Hållbarhet'!B10","v":""},null,null,null,null,{"$f":"'Börja här'!Q19","v":"Referensfall"}]
["Kalkylränta (real interest rate)",null,null,"%",0.05,null,null,null,null,{"$f":"IF('Börja här'!Q20=\"\",\"\",'Börja här'!Q20)","v":""}]
["Årlig uppräkning av kostnaderna",null,null,"%",0.02,null,null,null,null,{"$f":"IF('Börja här'!Q21=\"\",\"\",'Börja här'!Q21)","v":""}]
[null,null,null,null,null,null,null,null,null,{"$f":"IF('Börja här'!Q22=\"\",\"\",'Börja här'!Q22)","v":""}]
[null,null,null,null,null,null,null,null,null,{"$f":"IF('Börja här'!Q23=\"\",\"\",'Börja här'!Q23)","v":""}]
[null,null,null,null,"OBS! Tryck på \"Räkna LCC\" varje gång för att få resultat!",null,null,null,null,{"$f":"IF('Börja här'!Q24=\"\",\"\",'Börja här'!Q24)","v":""}]
[null,null,null,null,null,null,null,null,null,{"$f":"IF('Börja här'!Q25=\"\",\"\",'Börja här'!Q25)","v":""}]
[null,null,null,null,null,null,null,null,null,{"$f":"IF('Börja här'!Q26=\"\",\"\",'Börja här'!Q26)","v":""}]
[null,null,null,null,null,null,null,null,null,{"$f":"IF('Börja här'!Q27=\"\",\"\",'Börja här'!Q27)","v":""}]
[null,null,null,null,null,null,null,null,null,{"$f":"IF('Börja här'!Q28=\"\",\"\",'Börja här'!Q28)","v":""}]
[]
["2. Resultat"]
[]
[null,null,null,null,{"$f":"J12","v":"Referensfall"},{"$f":"J13","v":""},{"$f":"J14","v":""},{"$f":"J15","v":""},{"$f":"J16","v":""},{"$f":"J17","v":""},{"$f":"J18","v":""},{"$f":"J19","v":""},{"$f":"J20","v":""},{"$f":"J21","v":""}]
["Investeringar",null,null,"kr",{"$f":"E67","v":0},0,0,0,0,0,0,0,0,0]
["Reinvesteringar/utbyte",null,null,"kr",{"$f":"E97","v":{"$error":"#VALUE!"}},{"$error":"#VALUE!"},{"$error":"#VALUE!"},{"$error":"#VALUE!"},{"$error":"#VALUE!"},{"$error":"#VALUE!"},{"$error":"#VALUE!"},{"$error":"#VALUE!"},{"$error":"#VALUE!"},{"$error":"#VALUE!"}]
["Löpande drift/underhåll",null,null,"kr",{"$f":"E113","v":{"$error":"#VALUE!"}},{"$error":"#VALUE!"},{"$error":"#VALUE!"},{"$error":"#VALUE!"},{"$error":"#VALUE!"},{"$error":"#VALUE!"},{"$error":"#VALUE!"},{"$error":"#VALUE!"},{"$error":"#VALUE!"},{"$error":"#VALUE!"}]
["Energi",null,null,"kr",{"$f":"E138","v":{"$error":"#VALUE!"}},{"$error":"#VALUE!"},{"$error":"#VALUE!"},{"$error":"#VALUE!"},{"$error":"#VALUE!"},{"$error":"#VALUE!"},{"$error":"#VALUE!"},{"$error":"#VALUE!"},{"$error":"#VALUE!"},{"$error":"#VALUE!"}]
[]
["Total LCC-kostnad",null,null,"kr",{"$f":"SUM(E26:E29)","v":{"$error":"#VALUE!"}},{"$f":"SUM(F26:F29)","v":{"$error":"#VALUE!"}},{"$error":"#VALUE!"},{"$error":"#VALUE!"},{"$error":"#VALUE!"},{"$error":"#VALUE!"},{"$error":"#VALUE!"},{"$error":"#VALUE!"},{"$error":"#VALUE!"},{"$error":"#VALUE!"}]
[]
[]
[]
[]
[]
[]
[]
[]
[]
[]
[]
[]
[]
[]
[]
[]
[]
[]
[]
[]
[]
[]
[]
[]
[]
[]
[]
[]
[null,null,null,null,{"$f":"E25","v":"Referensfall"},"","","","","","","","",""]
["3. Investeringar"]
["A, aktuell kostnad",null,null,"kr"]
["B, aktuell kostnad",null,null,"kr"]
["C, aktuell kostnad",null,null,"kr"]
["D, aktuell kostnad",null,null,"kr"]
["E, aktuell kostnad",null,null,"kr"]
["Summa",null,null,"kr",{"$f":"SUM(E62:E66)","v":0},{"$f":"SUM(F62:F66)","v":0},0,0,0,0,0,0,0,0]
[]
[]
["2. Reinvesteringar/utbyte"]
["A, aktuell kostnad idag",null,null,"kr",0,null,null,0,0]
["A, år där första byte sker",null,null,"år"]
["A, prisökning/minskning",null,null,"%",{"$f":"$E$14","v":0.02},{"$f":"$E$14","v":0.02},0.02,0.02,0.02,0.02,0.02,0.02,0.02,0.02]
["A, livslängd på installationen",null,null,"år",10,10,10,10,10,10,10,10,10,10]
["A, antal byten under LCC period",null,null,null,{"$f":"IF(INT(($E$12-E72)/E74)=0,1,INT(($E$12-E72)/E74))","v":{"$error":"#VALUE!"}},{"$f":"IF(INT(($E$12-F72)/F74)=0,1,INT(($E$12-F72)/F74))","v":{"$error":"#VALUE!"}},{"$error":"#VALUE!"},{"$error":"#VALUE!"},{"$error":"#VALUE!"},{"$error":"#VALUE!"},{"$error":"#VALUE!"},{"$error":"#VALUE!"},{"$error":"#VALUE!"},{"$error":"#VALUE!"}]
["A, restvärde (diskonterat)",null,null,"kr",{"$f":"E71*((1+E73)^($E$12))*ABS(($E$12-((E75*E74)+E72))/E74)*((1+IntReal)^(-$E$12))","v":{"$error":"#VALUE!"}},{"$error":"#VALUE!"},{"$error":"#VALUE!"},{"$error":"#VALUE!"},{"$error":"#VALUE!"},{"$error":"#VALUE!"},{"$error":"#VALUE!"},{"$error":"#VALUE!"},{"$error":"#VALUE!"},{"$error":"#VALUE!"}]
[]
[]
["B, aktuell kostnad idag",null,null,"kr"]
["B, år där första byte sker"]
["B, prisökning/minskning",null,null,"%",{"$f":"$E$14","v":0.02},{"$f":"$E$14","v":0.02},0.02,0.02,0.02,0.02,0.02,0.02,0.02,0.02]
["B, livslängd på installationen",null,null,"år",10,10,10,10,10,10,10,10,10,10]
["B, antal byte under LCC period",null,null,null,{"$f":"IF(INT(($E$12-E80)/E82)=0,1,INT(($E$12-E80)/E82))","v":{"$error":"#VALUE!"}},{"$f":"IF(INT(($E$12-F80)/F82)=0,1,INT(($E$12-F80)/F82))","v":{"$error":"#VALUE!"}},{"$error":"#VALUE!"},{"$error":"#VALUE!"},{"$error":"#VALUE!"},{"$error":"#VALUE!"},{"$error":"#VALUE!"},{"$error":"#VALUE!"},{"$error":"#VALUE!"},{"$error":"#VALUE!"}]
["B, restvärde (diskonterat)",null,null,"kr",{"$f":"E79*((1+E81)^($E$12))*ABS(($E$12-((E83*E82)+E80))/E82)*((1+IntReal)^(-$E$12))","v":{"$error":"#VALUE!"}},{"$error":"#VALUE!"},{"$error":"#VALUE!"},{"$error":"#VALUE!"},{"$error":"#VALUE!"},{"$error":"#VALUE!"},{"$error":"#VALUE!"},{"$error":"#VALUE!"},{"$error":"#VALUE!"},{"$error":"#VALUE!"}]
[]
[]
["C, aktuell kostnad idag",null,null,"kr"]
["C, år där första byte sker"]
["C, prisökning/minskning",null,null,"%",{"$f":"$E$14","v":0.02},{"$f":"$E$14","v":0.02},0.02,0.02,0.02,0.02,0.02,0.02,0.02,0.02]
["C, livslängd på installationen",null,null,"år",10,10,10,10,10,10,10,10,10,10]
["C, antal byte under LCC period",null,null,null,{"$f":"IF(INT(($E$12-E88)/E90)=0,1,INT(($E$12-E88)/E90))","v":{"$error":"#VALUE!"}},{"$f":"IF(INT(($E$12-F88)/F90)=0,1,INT(($E$12-F88)/F90))","v":{"$error":"#VALUE!"}},{"$error":"#VALUE!"},{"$error":"#VALUE!"},{"$error":"#VALUE!"},{"$error":"#VALUE!"},{"$error":"#VALUE!"},{"$error":"#VALUE!"},{"$error":"#VALUE!"},{"$error":"#VALUE!"}]
["C, restvärde (diskonterat)",null,null,"kr",{"$f":"E87*((1+E89)^($E$12))*ABS(($E$12-((E91*E90)+E88))/E90)*((1+IntReal)^(-$E$12))","v":{"$error":"#VALUE!"}},{"$error":"#VALUE!"},{"$error":"#VALUE!"},{"$error":"#VALUE!"},{"$error":"#VALUE!"},{"$error":"#VALUE!"},{"$error":"#VALUE!"},{"$error":"#VALUE!"},{"$error":"#VALUE!"},{"$error":"#VALUE!"}]
[]
["NPV, post A",null,null,"kr",0,0,0,0,0,0,0,0,0,0]
["NPV, post B",null,null,"kr",0,0,0,0,0,0,0,0,0,0]
["NPV, post C",null,null,"kr",0,0,0,0,0,0,0,0,0,0]
["Summa NPV",null,null,"kr",{"$f":"SUM(E94:E96)-(E76+E84+E92)","v":{"$error":"#VALUE!"}},{"$f":"SUM(F94:F96)-(F76+F84+F92)","v":{"$error":"#VALUE!"}},{"$f":"SUM(G94:G96)-(G76+G84+G92)","v":{"$error":"#VALUE!"}},{"$error":"#VALUE!"},{"$error":"#VALUE!"},{"$error":"#VALUE!"},{"$error":"#VALUE!"},{"$error":"#VALUE!"},{"$error":"#VALUE!"},{"$error":"#VALUE!"}]
[]
[]
["3. Löpande drift/underhåll"]
["A, nuvarande årlig kostnad",null,null,"kr/år",0]
["A, prisökning/minskning",null,null,"%",{"$f":"$E$14","v":0.02},{"$f":"$E$14","v":0.02},0.02,0.02,0.02,0.02,0.02,0.02,0.02,0.02]
[]
["B, nuvarande årlig kostnad",null,null,"kr/år",0]
["B, prisökning/minskning",null,null,"%",{"$f":"$E$14","v":0.02},{"$f":"$E$14","v":0.02},0.02,0.02,0.02,0.02,0.02,0.02,0.02,0.02]
[]
["C, nuvarande årlig kostnad",null,null,"kr/år"]
["C, prisökning/minskning",null,null,"%",{"$f":"$E$14","v":0.02},{"$f":"$E$14","v":0.02},0.02,0.02,0.02,0.02,0.02,0.02,0.02,0.02]
[]
["NPV, post A",null,null,"kr",{"$f":"IF(E102=$E$13, E101*(1+E102)*($E$12/(1+$E$13)), E101*(1+E102)*((1-((1+E102)^$E$12)*((1+$E$13)^(-$E$12)))/($E$13-E102)))","v":{"$error":"#VALUE!"}},{"$f":"IF(F102=$E$13, F101*(1+F102)*($E$12/(1+$E$13)), F101*(1+F102)*((1-((1+F102)^$E$12)*((1+$E$13)^(-$E$12)))/($E$13-F102)))","v":{"$error":"#VALUE!"}},{"$f":"IF(G102=$E$13, G101*(1+G102)*($E$12/(1+$E$13)), G101*(1+G102)*((1-((1+G102)^$E$12)*((1+$E$13)^(-$E$12)))/($E$13-G102)))","v":{"$error":"#VALUE!"}},{"$f":"IF(H102=$E$13, H101*(1+H102)*($E$12/(1+$E$13)), H101*(1+H102)*((1-((1+H102)^$E$12)*((1+$E$13)^(-$E$12)))/($E$13-H102)))","v":{"$error":"#VALUE!"}},{"$f":"IF(I102=$E$13, I101*(1+I102)*($E$12/(1+$E$13)), I101*(1+I102)*((1-((1+I102)^$E$12)*((1+$E$13)^(-$E$12)))/($E$13-I102)))","v":{"$error":"#VALUE!"}},{"$f":"IF(J102=$E$13, J101*(1+J102)*($E$12/(1+$E$13)), J101*(1+J102)*((1-((1+J102)^$E$12)*((1+$E$13)^(-$E$12)))/($E$13-J102)))","v":{"$error":"#VALUE!"}},{"$error":"#VALUE!"},{"$error":"#VALUE!"},{"$error":"#VALUE!"},{"$error":"#VALUE!"}]
["NPV, post B",null,null,"kr",{"$f":"IF(E105=$E$13, E104*(1+E105)*($E$12/(1+$E$13)), E104*(1+E105)*((1-((1+E105)^$E$12)*((1+$E$13)^(-$E$12)))/($E$13-E105)))","v":{"$error":"#VALUE!"}},{"$f":"IF(F105=$E$13, F104*(1+F105)*($E$12/(1+$E$13)), F104*(1+F105)*((1-((1+F105)^$E$12)*((1+$E$13)^(-$E$12)))/($E$13-F105)))","v":{"$error":"#VALUE!"}},{"$error":"#VALUE!"},{"$error":"#VALUE!"},{"$error":"#VALUE!"},{"$error":"#VALUE!"},{"$error":"#VALUE!"},{"$error":"#VALUE!"},{"$error":"#VALUE!"},{"$error":"#VALUE!"}]
["NPV, post C",null,null,"kr",{"$f":"IF(E108=$E$13, E107*(1+E108)*($E$12/(1+$E$13)), E107*(1+E108)*((1-((1+E108)^$E$12)*((1+$E$13)^(-$E$12)))/($E$13-E108)))","v":{"$error":"#VALUE!"}},{"$f":"IF(F108=$E$13, F107*(1+F108)*($E$12/(1+$E$13)), F107*(1+F108)*((1-((1+F108)^$E$12)*((1+$E$13)^(-$E$12)))/($E$13-F108)))","v":{"$error":"#VALUE!"}},{"$error":"#VALUE!"},{"$error":"#VALUE!"},{"$error":"#VALUE!"},{"$error":"#VALUE!"},{"$error":"#VALUE!"},{"$error":"#VALUE!"},{"$error":"#VALUE!"},{"$error":"#VALUE!"}]
["Summa",null,null,"kr",{"$f":"SUM(E110:E112)","v":{"$error":"#VALUE!"}},{"$f":"SUM(F110:F112)","v":{"$error":"#VALUE!"}},{"$error":"#VALUE!"},{"$error":"#VALUE!"},{"$error":"#VALUE!"},{"$error":"#VALUE!"},{"$error":"#VALUE!"},{"$error":"#VALUE!"},{"$error":"#VALUE!"},{"$error":"#VALUE!"}]
[]
[]
["4. Energi"]
["4.1 El"]
["Användande per år",null,null,"kWh/år"]
["Kostnad per kWh",null,null,"kr/kWh"]
["Prisökning/minskning, el",null,null,"%",{"$f":"$E$14","v":0.02},{"$f":"$E$14","v":0.02},0.02,0.02,0.02,0.02,0.02,0.02,0.02,0.02]
["Kostnad per år",null,null,"kr",{"$f":"E118*E119","v":0},{"$f":"F118*F119","v":0},0,0,0,0,0,0,0,0]
["NPV, el",null,null,"kr",{"$f":"IF(E120=$E$13, E121*(1+E120)*($E$12/(1+$E$13)), E121*(1+E120)*((1-((1+E120)^$E$12)*((1+$E$13)^(-$E$12)))/($E$13-E120)))","v":{"$error":"#VALUE!"}},{"$f":"IF(F120=$E$13, F121*(1+F120)*($E$12/(1+$E$13)), F121*(1+F120)*((1-((1+F120)^$E$12)*((1+$E$13)^(-$E$12)))/($E$13-F120)))","v":{"$error":"#VALUE!"}},{"$error":"#VALUE!"},{"$error":"#VALUE!"},{"$error":"#VALUE!"},{"$error":"#VALUE!"},{"$error":"#VALUE!"},{"$error":"#VALUE!"},{"$error":"#VALUE!"},{"$error":"#VALUE!"}]
[]
["4.2 Fjärrvärme"]
["Användande per år",null,null,"kWh/år"]
["Kostnad per kWh",null,null,"kr/kWh"]
["Prisökning/minskning, fjärrv",null,null,"%",{"$f":"$E$14","v":0.02},{"$f":"$E$14","v":0.02},0.02,0.02,0.02,0.02,0.02,0.02,0.02,0.02]
["Kostnad per år",null,null,"kr",{"$f":"E125*E126","v":0},{"$f":"F125*F126","v":0},0,0,0,0,0,0,0,0]
["NPV, fjärrvärme",null,null,"kr",{"$f":"IF(E127=$E$13, E128*(1+E127)*($E$12/(1+$E$13)), E128*(1+E127)*((1-((1+E127)^$E$12)*((1+$E$13)^(-$E$12)))/($E$13-E127)))","v":{"$error":"#VALUE!"}},{"$f":"IF(F127=$E$13, F128*(1+F127)*($E$12/(1+$E$13)), F128*(1+F127)*((1-((1+F127)^$E$12)*((1+$E$13)^(-$E$12)))/($E$13-F127)))","v":{"$error":"#VALUE!"}},{"$error":"#VALUE!"},{"$error":"#VALUE!"},{"$error":"#VALUE!"},{"$error":"#VALUE!"},{"$error":"#VALUE!"},{"$error":"#VALUE!"},{"$error":"#VALUE!"},{"$error":"#VALUE!"}]
[]
["4.3 Övrig energi"]
["Användande per år",null,null,"kWh/år"]
["Kostnad per kWh",null,null,"kr/kWh"]
["Prisökning/minskning, övrig energi",null,null,"%",{"$f":"$E$14","v":0.02},{"$f":"$E$14","v":0.02},0.02,0.02,0.02,0.02,0.02,0.02,0.02,0.02]
["Kostnad per år",null,null,"kr",{"$f":"E132*E133","v":0},{"$f":"F132*F133","v":0},0,0,0,0,0,0,0,0]
["NPV, värme/kyla",null,null,"kr",{"$f":"IF(E134=$E$13, E135*(1+E134)*($E$12/(1+$E$13)), E135*(1+E134)*((1-((1+E134)^$E$12)*((1+$E$13)^(-$E$12)))/($E$13-E134)))","v":{"$error":"#VALUE!"}},{"$f":"IF(F134=$E$13, F135*(1+F134)*($E$12/(1+$E$13)), F135*(1+F134)*((1-((1+F134)^$E$12)*((1+$E$13)^(-$E$12)))/($E$13-F134)))","v":{"$error":"#VALUE!"}},{"$error":"#VALUE!"},{"$error":"#VALUE!"},{"$error":"#VALUE!"},{"$error":"#VALUE!"},{"$error":"#VALUE!"},{"$error":"#VALUE!"},{"$error":"#VALUE!"},{"$error":"#VALUE!"}]
[]
["Summa",null,null,"kr",{"$f":"E122+E129+E136","v":{"$error":"#VALUE!"}},{"$f":"F122+F129+F136","v":{"$error":"#VALUE!"}},{"$error":"#VALUE!"},{"$error":"#VALUE!"},{"$error":"#VALUE!"},{"$error":"#VALUE!"},{"$error":"#VALUE!"},{"$error":"#VALUE!"},{"$error":"#VALUE!"},{"$error":"#VALUE!"}]

{"sheet":"Miljö","index":3,"n_rows":397,"n_cols":12,"rows_kept":397,"cut":false,"hidden":false,"merged":[[17,6,17,11],[12,6,12,11],[13,6,13,11],[14,6,14,11],[15,6,15,11],[16,6,16,11],[18,1,18,2],[18,6,18,11],[19,6,19,11],[20,6,20,11],[21,6,21,11]]}
[null,"Miljöanalys"]
["Detta blad används för miljömässig utvärdering i livscykelperspektiv."]
[]
["Så här fungerar det:"]
[]
["Ange indata i de gröna fälten och välj i rullisterna."]
["Beräkningarna avser jämförelse mot referensfall. Endast åtgärder som skiljer respektive alternativ mot referensfallet ska beskrivas och inga ev. åtgärder i referensfallet ska beskrivas."]
["Extra förklaringar finns i vissa fall i kommentarsfält (röd triangel i höger hörn)."]
[]
[]
["1. Grundförutsättningar",null,null,null,"1.3 Kort beskrivning av alternativen"]
["1.1 Allmänt",null,null,null,"Alt. nummer",null,"Beskrivning"]
["Projekt:",null,{"$f":"IF('Börja här'!R12=\"\",\"\",'Börja här'!R12)","v":""},null,{"$f":"'Börja här'!Q19","v":"Referensfall"},true]
["Datum:",null,null,null,{"$f":"IF('Börja här'!Q20=\"\",\"\",'Börja här'!Q20)","v":""},{"$f":"IF('Börja här'!$R$15>1,TRUE,FALSE)","v":false}]
["Utförare",null,null,null,{"$f":"IF('Börja här'!Q21=\"\",\"\",'Börja här'!Q21)","v":""},{"$f":"IF('Börja här'!$R$15>2,TRUE,FALSE)","v":false}]
["Beräkningsperiod:","år",{"$f":"'Börja här'!R16","v":0},null,{"$f":"IF('Börja här'!Q22=\"\",\"\",'Börja här'!Q22)","v":""},{"$f":"IF('Börja här'!$R$15>3,TRUE,FALSE)","v":false}]
[null,null,null,null,{"$f":"IF('Börja här'!Q23=\"\",\"\",'Börja här'!Q23)","v":""},{"$f":"IF('Börja här'!$R$15>4,TRUE,FALSE)","v":false}]
["1.2 Miljödata för fjärrvärme","Om alt. med fjärrvärme finns (före och/eller efter renovering)",null,null,{"$f":"IF('Börja här'!Q24=\"\",\"\",'Börja här'!Q24)","v":""},{"$f":"IF('Börja här'!$R$15>5,TRUE,FALSE)","v":false}]
["Lokal miljöpåverkan fjärrvärme, se länken:","Svensk Fjärrvärmes lokala miljövärden",null,null,{"$f":"IF('Börja här'!Q25=\"\",\"\",'Börja här'!Q25)","v":""},{"$f":"IF('Börja här'!$R$15>6,TRUE,FALSE)","v":false}]
["Klimatpåverkan (Emission av växhusgaser)","g CO2-ekv/kWh",{"$f":"Defaultvärden!C6","v":83},null,{"$f":"IF('Börja här'!Q26=\"\",\"\",'Börja här'!Q26)","v":""},{"$f":"IF('Börja här'!$R$15>7,TRUE,FALSE)","v":false}]
["Primärenergifaktor","kWh/kWh",{"$f":"Defaultvärden!C7","v":0.79},null,{"$f":"IF('Börja här'!Q27=\"\",\"\",'Börja här'!Q27)","v":""},{"$f":"IF('Börja här'!$R$15>8,TRUE,FALSE)","v":false}]
[null,null,null,null,{"$f":"IF('Börja här'!Q28=\"\",\"\",'Börja här'!Q28)","v":""},{"$f":"IF('Börja här'!$R$15>9,TRUE,FALSE)","v":false}]
[]
["1.4 Storlek på byggnad",null,{"$f":"E13","v":"Referensfall"},{"$f":"E14","v":""},{"$f":"E15","v":""},{"$f":"E16","v":""},{"$f":"E17","v":""},{"$f":"E18","v":""},{"$f":"E19","v":""},{"$f":"E20","v":""},{"$f":"E21","v":""},{"$f":"E22","v":""}]
["Area, kvm","m2, Atemp"]
[]
[]
["2. Resultat, ändring i miljöpåverkan under angiven beräkningsperiod jämfört med referensfallet "]
["2.1 Total ändring i miljöpåverkan",null,{"$f":"C24","v":"Referensfall"},{"$f":"D24","v":""},"","","","","","","",""]
["Klimatpåverkan","ton CO2-ekv",0,{"$f":"IF(F14=TRUE,Calc!D139/1000,0)","v":0},{"$f":"IF(F15=TRUE,Calc!E139/1000,0)","v":0},{"$f":"IF(F16=TRUE,Calc!F139/1000,0)","v":0},{"$f":"IF(F17=TRUE,Calc!G139/1000,0)","v":0},{"$f":"IF(F18=TRUE,Calc!H139/1000,0)","v":0},{"$f":"IF(F19=TRUE,Calc!I139/1000,0)","v":0},{"$f":"IF(F20=TRUE,Calc!J139/1000,0)","v":0},{"$f":"IF(F21=TRUE,Calc!K139/1000,0)","v":0},{"$f":"IF(F22=TRUE,Calc!L139/1000,0)","v":0}]
["Primärenergi","MWh primärenergi",0,{"$f":"IF(F14=TRUE,Calc!D245/1000,0)","v":0},{"$f":"IF(F15=TRUE,Calc!E245/1000,0)","v":0},{"$f":"IF(F16=TRUE,Calc!F245/1000,0)","v":0},{"$f":"IF(F17=TRUE,Calc!G245/1000,0)","v":0},{"$f":"IF(F18=TRUE,Calc!H245/1000,0)","v":0},{"$f":"IF(F19=TRUE,Calc!I245/1000,0)","v":0},{"$f":"IF(F20=TRUE,Calc!J245/1000,0)","v":0},{"$f":"IF(F21=TRUE,Calc!K245/1000,0)","v":0},{"$f":"IF(F22=TRUE,Calc!L245/1000,0)","v":0}]
[]
["2.2 Klimatpåverkan fördelat på delprocesser"]
["Produktion","ton CO2-ekv",0,{"$f":"IF($F$14=TRUE,SUMPRODUCT(Calc!D$5:D$34,Calc!D38:D67)/1000-D35,0)","v":0},{"$f":"IF($F$15=TRUE,SUMPRODUCT(Calc!E$5:E$34,Calc!E38:E67)/1000-E35,0)","v":0},{"$f":"IF($F$16=TRUE,SUMPRODUCT(Calc!F$5:F$34,Calc!F38:F67)/1000-F35,0)","v":0},{"$f":"IF($F$17=TRUE,SUMPRODUCT(Calc!G$5:G$34,Calc!G38:G67)/1000-G35,0)","v":0},{"$f":"IF($F$18=TRUE,SUMPRODUCT(Calc!H$5:H$34,Calc!H38:H67)/1000-H35,0)","v":0},{"$f":"IF($F$19=TRUE,SUMPRODUCT(Calc!I$5:I$34,Calc!I38:I67)/1000-I35,0)","v":0},{"$f":"IF($F$20=TRUE,SUMPRODUCT(Calc!J$5:J$34,Calc!J38:J67)/1000-J35,0)","v":0},{"$f":"IF($F$21=TRUE,SUMPRODUCT(Calc!K$5:K$34,Calc!K38:K67)/1000-K35,0)","v":0},{"$f":"IF($F$22=TRUE,SUMPRODUCT(Calc!L$5:L$34,Calc!L38:L67)/1000-L35,0)","v":0}]
["Transport","ton CO2-ekv",0,{"$f":"IF($F$14=TRUE,(Calc!D$5*Trp!D135+Calc!D$6*Trp!D136+Calc!D$7*Trp!D137+Calc!D$8*Trp!D138+Calc!D$9*Trp!D139+Calc!D$10*Trp!D140+Calc!D$12*Trp!D141+Calc!D$13*Trp!D142+Calc!D$14*Trp!D143+Calc!D$15*Trp!D144+Calc!D34*Trp!D146+SUMPRODUCT(Calc!D16:D25,Trp!D147:D156)+Calc!D$26*Trp!D157+Calc!D$27*Trp!D158+Calc!D$28*Trp!D159+Calc!D$29*Trp!D160+Calc!D$30*Trp!D161+Calc!D$31*Trp!D162+Calc!D$32*Trp!D164+Calc!D$33*Trp!D165)/1000,0)","v":0},{"$f":"IF($F$15=TRUE,(Calc!E$5*Trp!E135+Calc!E$6*Trp!E136+Calc!E$7*Trp!E137+Calc!E$8*Trp!E138+Calc!E$9*Trp!E139+Calc!E$10*Trp!E140+Calc!E$12*Trp!E141+Calc!E$13*Trp!E142+Calc!E$14*Trp!E143+Calc!E$15*Trp!E144+Calc!E34*Trp!E146+SUMPRODUCT(Calc!E16:E25,Trp!E147:E156)+Calc!E$26*Trp!E157+Calc!E$27*Trp!E158+Calc!E$28*Trp!E159+Calc!E$29*Trp!E160+Calc!E$30*Trp!E161+Calc!E$31*Trp!E162+Calc!E$32*Trp!E164+Calc!E$33*Trp!E165)/1000,0)","v":0},{"$f":"IF($F$16=TRUE,(Calc!F$5*Trp!F135+Calc!F$6*Trp!F136+Calc!F$7*Trp!F137+Calc!F$8*Trp!F138+Calc!F$9*Trp!F139+Calc!F$10*Trp!F140+Calc!F$12*Trp!F141+Calc!F$13*Trp!F142+Calc!F$14*Trp!F143+Calc!F$15*Trp!F144+Calc!F34*Trp!F146+SUMPRODUCT(Calc!F16:F25,Trp!F147:F156)+Calc!F$26*Trp!F157+Calc!F$27*Trp!F158+Calc!F$28*Trp!F159+Calc!F$29*Trp!F160+Calc!F$30*Trp!F161+Calc!F$31*Trp!F162+Calc!F$32*Trp!F164+Calc!F$33*Trp!F165)/1000,0)","v":0},{"$f":"IF($F$17=TRUE,(Calc!G$5*Trp!G135+Calc!G$6*Trp!G136+Calc!G$7*Trp!G137+Calc!G$8*Trp!G138+Calc!G$9*Trp!G139+Calc!G$10*Trp!G140+Calc!G$12*Trp!G141+Calc!G$13*Trp!G142+Calc!G$14*Trp!G143+Calc!G$15*Trp!G144+Calc!G34*Trp!G146+SUMPRODUCT(Calc!G16:G25,Trp!G147:G156)+Calc!G$26*Trp!G157+Calc!G$27*Trp!G158+Calc!G$28*Trp!G159+Calc!G$29*Trp!G160+Calc!G$30*Trp!G161+Calc!G$31*Trp!G162+Calc!G$32*Trp!G164+Calc!G$33*Trp!G165)/1000,0)","v":0},{"$f":"IF($F$18=TRUE,(Calc!H$5*Trp!H135+Calc!H$6*Trp!H136+Calc!H$7*Trp!H137+Calc!H$8*Trp!H138+Calc!H$9*Trp!H139+Calc!H$10*Trp!H140+Calc!H$12*Trp!H141+Calc!H$13*Trp!H142+Calc!H$14*Trp!H143+Calc!H$15*Trp!H144+Calc!H34*Trp!H146+SUMPRODUCT(Calc!H16:H25,Trp!H147:H156)+Calc!H$26*Trp!H157+Calc!H$27*Trp!H158+Calc!H$28*Trp!H159+Calc!H$29*Trp!H160+Calc!H$30*Trp!H161+Calc!H$31*Trp!H162+Calc!H$32*Trp!H164+Calc!H$33*Trp!H165)/1000,0)","v":0},{"$f":"IF($F$19=TRUE,(Calc!I$5*Trp!I135+Calc!I$6*Trp!I136+Calc!I$7*Trp!I137+Calc!I$8*Trp!I138+Calc!I$9*Trp!I139+Calc!I$10*Trp!I140+Calc!I$12*Trp!I141+Calc!I$13*Trp!I142+Calc!I$14*Trp!I143+Calc!I$15*Trp!I144+Calc!I34*Trp!I146+SUMPRODUCT(Calc!I16:I25,Trp!I147:I156)+Calc!I$26*Trp!I157+Calc!I$27*Trp!I158+Calc!I$28*Trp!I159+Calc!I$29*Trp!I160+Calc!I$30*Trp!I161+Calc!I$31*Trp!I162+Calc!I$32*Trp!I164+Calc!I$33*Trp!I165)/1000,0)","v":0},{"$f":"IF($F$20=TRUE,(Calc!J$5*Trp!J135+Calc!J$6*Trp!J136+Calc!J$7*Trp!J137+Calc!J$8*Trp!J138+Calc!J$9*Trp!J139+Calc!J$10*Trp!J140+Calc!J$12*Trp!J141+Calc!J$13*Trp!J142+Calc!J$14*Trp!J143+Calc!J$15*Trp!J144+Calc!J34*Trp!J146+SUMPRODUCT(Calc!J16:J25,Trp!J147:J156)+Calc!J$26*Trp!J157+Calc!J$27*Trp!J158+Calc!J$28*Trp!J159+Calc!J$29*Trp!J160+Calc!J$30*Trp!J161+Calc!J$31*Trp!J162+Calc!J$32*Trp!J164+Calc!J$33*Trp!J165)/1000,0)","v":0},{"$f":"IF($F$21=TRUE,(Calc!K$5*Trp!K135+Calc!K$6*Trp!K136+Calc!K$7*Trp!K137+Calc!K$8*Trp!K138+Calc!K$9*Trp!K139+Calc!K$10*Trp!K140+Calc!K$12*Trp!K141+Calc!K$13*Trp!K142+Calc!K$14*Trp!K143+Calc!K$15*Trp!K144+Calc!K34*Trp!K146+SUMPRODUCT(Calc!K16:K25,Trp!K147:K156)+Calc!K$26*Trp!K157+Calc!K$27*Trp!K158+Calc!K$28*Trp!K159+Calc!K$29*Trp!K160+Calc!K$30*Trp!K161+Calc!K$31*Trp!K162+Calc!K$32*Trp!K164+Calc!K$33*Trp!K165)/1000,0)","v":0},{"$f":"IF($F$22=TRUE,(Calc!L$5*Trp!L135+Calc!L$6*Trp!L136+Calc!L$7*Trp!L137+Calc!L$8*Trp!L138+Calc!L$9*Trp!L139+Calc!L$10*Trp!L140+Calc!L$12*Trp!L141+Calc!L$13*Trp!L142+Calc!L$14*Trp!L143+Calc!L$15*Trp!L144+Calc!L34*Trp!L146+SUMPRODUCT(Calc!L16:L25,Trp!L147:L156)+Calc!L$26*Trp!L157+Calc!L$27*Trp!L158+Calc!L$28*Trp!L159+Calc!L$29*Trp!L160+Calc!L$30*Trp!L161+Calc!L$31*Trp!L162+Calc!L$32*Trp!L164+Calc!L$33*Trp!L165)/1000,0)","v":0}]
["Användningsfas","ton CO2-ekv",0,{"$f":"IF(F14=TRUE,(Calc!D75*$C$16)/1000,0)","v":0},{"$f":"IF(F15=TRUE,(Calc!E75*$C$16)/1000,0)","v":0},{"$f":"IF(F16=TRUE,(Calc!F75*$C$16)/1000,0)","v":0},{"$f":"IF(F17=TRUE,(Calc!G75*$C$16)/1000,0)","v":0},{"$f":"IF(F18=TRUE,(Calc!H75*$C$16)/1000,0)","v":0},{"$f":"IF(F19=TRUE,(Calc!I75*$C$16)/1000,0)","v":0},{"$f":"IF(F20=TRUE,(Calc!J75*$C$16)/1000,0)","v":0},{"$f":"IF(F21=TRUE,(Calc!K75*$C$16)/1000,0)","v":0},{"$f":"IF(F22=TRUE,(Calc!L75*$C$16)/1000,0)","v":0}]
["Avfallshantering","ton CO2-ekv",0,{"$f":"IF($F$14=TRUE,(SUMPRODUCT(Calc!D5:D10,Calc!D78:D83)+SUMPRODUCT(Calc!D12:D34,Calc!D84:D106))/1000,0)","v":0},{"$f":"IF($F$15=TRUE,(SUMPRODUCT(Calc!E5:E10,Calc!E78:E83)+SUMPRODUCT(Calc!E12:E34,Calc!E84:E106))/1000,0)","v":0},{"$f":"IF($F$16=TRUE,(SUMPRODUCT(Calc!F5:F10,Calc!F78:F83)+SUMPRODUCT(Calc!F12:F34,Calc!F84:F106))/1000,0)","v":0},{"$f":"IF($F$17=TRUE,(SUMPRODUCT(Calc!G5:G10,Calc!G78:G83)+SUMPRODUCT(Calc!G12:G34,Calc!G84:G106))/1000,0)","v":0},{"$f":"IF($F$18=TRUE,(SUMPRODUCT(Calc!H5:H10,Calc!H78:H83)+SUMPRODUCT(Calc!H12:H34,Calc!H84:H106))/1000,0)","v":0},{"$f":"IF($F$19=TRUE,(SUMPRODUCT(Calc!I5:I10,Calc!I78:I83)+SUMPRODUCT(Calc!I12:I34,Calc!I84:I106))/1000,0)","v":0},{"$f":"IF($F$20=TRUE,(SUMPRODUCT(Calc!J5:J10,Calc!J78:J83)+SUMPRODUCT(Calc!J12:J34,Calc!J84:J106))/1000,0)","v":0},{"$f":"IF($F$21=TRUE,(SUMPRODUCT(Calc!K5:K10,Calc!K78:K83)+SUMPRODUCT(Calc!K12:K34,Calc!K84:K106))/1000,0)","v":0},{"$f":"IF($F$22=TRUE,(SUMPRODUCT(Calc!L5:L10,Calc!L78:L83)+SUMPRODUCT(Calc!L12:L34,Calc!L84:L106))/1000,0)","v":0}]
[]
["2.3 Användning av primärenergi fördelat på delprocesser"]
["Produktion","MWh primärenergi",0,{"$f":"IF($F$14=TRUE,SUMPRODUCT(Calc!D$5:D$34,Calc!D145:D174)/1000-D41,0)","v":0},{"$f":"IF($F$15=TRUE,SUMPRODUCT(Calc!E$5:E$34,Calc!E145:E174)/1000-E41,0)","v":0},{"$f":"IF($F$16=TRUE,SUMPRODUCT(Calc!F$5:F$34,Calc!F145:F174)/1000-F41,0)","v":0},{"$f":"IF($F$17=TRUE,SUMPRODUCT(Calc!G$5:G$34,Calc!G145:G174)/1000-G41,0)","v":0},{"$f":"IF($F$18=TRUE,SUMPRODUCT(Calc!H$5:H$34,Calc!H145:H174)/1000-H41,0)","v":0},{"$f":"IF($F$19=TRUE,SUMPRODUCT(Calc!I$5:I$34,Calc!I145:I174)/1000-I41,0)","v":0},{"$f":"IF($F$20=TRUE,SUMPRODUCT(Calc!J$5:J$34,Calc!J145:J174)/1000-J41,0)","v":0},{"$f":"IF($F$21=TRUE,SUMPRODUCT(Calc!K$5:K$34,Calc!K145:K174)/1000-K41,0)","v":0},{"$f":"IF($F$22=TRUE,SUMPRODUCT(Calc!L$5:L$34,Calc!L145:L174)/1000-L41,0)","v":0}]
["Transport","MWh primärenergi",0,{"$f":"IF($F$14=TRUE,(Calc!D$5*Trp!D168+Calc!D$6*Trp!D169+Calc!D$7*Trp!D170+Calc!D$8*Trp!D171+Calc!D$9*Trp!D172+Calc!D$10*Trp!D173+Calc!D$12*Trp!D174+Calc!D$13*Trp!D175+Calc!D$14*Trp!D176+Calc!D$15*Trp!D177+Calc!D34*Trp!D179+SUMPRODUCT(Calc!D16:D25,Trp!D180:D189)+Calc!D$26*Trp!D190+Calc!D$27*Trp!D191+Calc!D$28*Trp!D192+Calc!D$29*Trp!D193+Calc!D$30*Trp!D194+Calc!D$31*Trp!D195+Calc!D$32*Trp!D197+Calc!D$33*Trp!D198)/1000,0)","v":0},{"$f":"IF($F$15=TRUE,(Calc!E$5*Trp!E168+Calc!E$6*Trp!E169+Calc!E$7*Trp!E170+Calc!E$8*Trp!E171+Calc!E$9*Trp!E172+Calc!E$10*Trp!E173+Calc!E$12*Trp!E174+Calc!E$13*Trp!E175+Calc!E$14*Trp!E176+Calc!E$15*Trp!E177+Calc!E34*Trp!E179+SUMPRODUCT(Calc!E16:E25,Trp!E180:E189)+Calc!E$26*Trp!E190+Calc!E$27*Trp!E191+Calc!E$28*Trp!E192+Calc!E$29*Trp!E193+Calc!E$30*Trp!E194+Calc!E$31*Trp!E195+Calc!E$32*Trp!E197+Calc!E$33*Trp!E198)/1000,0)","v":0},{"$f":"IF($F$16=TRUE,(Calc!F$5*Trp!F168+Calc!F$6*Trp!F169+Calc!F$7*Trp!F170+Calc!F$8*Trp!F171+Calc!F$9*Trp!F172+Calc!F$10*Trp!F173+Calc!F$12*Trp!F174+Calc!F$13*Trp!F175+Calc!F$14*Trp!F176+Calc!F$15*Trp!F177+Calc!F34*Trp!F179+SUMPRODUCT(Calc!F16:F25,Trp!F180:F189)+Calc!F$26*Trp!F190+Calc!F$27*Trp!F191+Calc!F$28*Trp!F192+Calc!F$29*Trp!F193+Calc!F$30*Trp!F194+Calc!F$31*Trp!F195+Calc!F$32*Trp!F197+Calc!F$33*Trp!F198)/1000,0)","v":0},{"$f":"IF($F$17=TRUE,(Calc!G$5*Trp!G168+Calc!G$6*Trp!G169+Calc!G$7*Trp!G170+Calc!G$8*Trp!G171+Calc!G$9*Trp!G172+Calc!G$10*Trp!G173+Calc!G$12*Trp!G174+Calc!G$13*Trp!G175+Calc!G$14*Trp!G176+Calc!G$15*Trp!G177+Calc!G34*Trp!G179+SUMPRODUCT(Calc!G16:G25,Trp!G180:G189)+Calc!G$26*Trp!G190+Calc!G$27*Trp!G191+Calc!G$28*Trp!G192+Calc!G$29*Trp!G193+Calc!G$30*Trp!G194+Calc!G$31*Trp!G195+Calc!G$32*Trp!G197+Calc!G$33*Trp!G198)/1000,0)","v":0},{"$f":"IF($F$18=TRUE,(Calc!H$5*Trp!H168+Calc!H$6*Trp!H169+Calc!H$7*Trp!H170+Calc!H$8*Trp!H171+Calc!H$9*Trp!H172+Calc!H$10*Trp!H173+Calc!H$12*Trp!H174+Calc!H$13*Trp!H175+Calc!H$14*Trp!H176+Calc!H$15*Trp!H177+Calc!H34*Trp!H179+SUMPRODUCT(Calc!H16:H25,Trp!H180:H189)+Calc!H$26*Trp!H190+Calc!H$27*Trp!H191+Calc!H$28*Trp!H192+Calc!H$29*Trp!H193+Calc!H$30*Trp!H194+Calc!H$31*Trp!H195+Calc!H$32*Trp!H197+Calc!H$33*Trp!H198)/1000,0)","v":0},{"$f":"IF($F$19=TRUE,(Calc!I$5*Trp!I168+Calc!I$6*Trp!I169+Calc!I$7*Trp!I170+Calc!I$8*Trp!I171+Calc!I$9*Trp!I172+Calc!I$10*Trp!I173+Calc!I$12*Trp!I174+Calc!I$13*Trp!I175+Calc!I$14*Trp!I176+Calc!I$15*Trp!I177+Calc!I34*Trp!I179+SUMPRODUCT(Calc!I16:I25,Trp!I180:I189)+Calc!I$26*Trp!I190+Calc!I$27*Trp!I191+Calc!I$28*Trp!I192+Calc!I$29*Trp!I193+Calc!I$30*Trp!I194+Calc!I$31*Trp!I195+Calc!I$32*Trp!I197+Calc!I$33*Trp!I198)/1000,0)","v":0},{"$f":"IF($F$20=TRUE,(Calc!J$5*Trp!J168+Calc!J$6*Trp!J169+Calc!J$7*Trp!J170+Calc!J$8*Trp!J171+Calc!J$9*Trp!J172+Calc!J$10*Trp!J173+Calc!J$12*Trp!J174+Calc!J$13*Trp!J175+Calc!J$14*Trp!J176+Calc!J$15*Trp!J177+Calc!J34*Trp!J179+SUMPRODUCT(Calc!J16:J25,Trp!J180:J189)+Calc!J$26*Trp!J190+Calc!J$27*Trp!J191+Calc!J$28*Trp!J192+Calc!J$29*Trp!J193+Calc!J$30*Trp!J194+Calc!J$31*Trp!J195+Calc!J$32*Trp!J197+Calc!J$33*Trp!J198)/1000,0)","v":0},{"$f":"IF($F$21=TRUE,(Calc!K$5*Trp!K168+Calc!K$6*Trp!K169+Calc!K$7*Trp!K170+Calc!K$8*Trp!K171+Calc!K$9*Trp!K172+Calc!K$10*Trp!K173+Calc!K$12*Trp!K174+Calc!K$13*Trp!K175+Calc!K$14*Trp!K176+Calc!K$15*Trp!K177+Calc!K34*Trp!K179+SUMPRODUCT(Calc!K16:K25,Trp!K180:K189)+Calc!K$26*Trp!K190+Calc!K$27*Trp!K191+Calc!K$28*Trp!K192+Calc!K$29*Trp!K193+Calc!K$30*Trp!K194+Calc!K$31*Trp!K195+Calc!K$32*Trp!K197+Calc!K$33*Trp!K198)/1000,0)","v":0},{"$f":"IF($F$22=TRUE,(Calc!L$5*Trp!L168+Calc!L$6*Trp!L169+Calc!L$7*Trp!L170+Calc!L$8*Trp!L171+Calc!L$9*Trp!L172+Calc!L$10*Trp!L173+Calc!L$12*Trp!L174+Calc!L$13*Trp!L175+Calc!L$14*Trp!L176+Calc!L$15*Trp!L177+Calc!L34*Trp!L179+SUMPRODUCT(Calc!L16:L25,Trp!L180:L189)+Calc!L$26*Trp!L190+Calc!L$27*Trp!L191+Calc!L$28*Trp!L192+Calc!L$29*Trp!L193+Calc!L$30*Trp!L194+Calc!L$31*Trp!L195+Calc!L$32*Trp!L197+Calc!L$33*Trp!L198)/1000,0)","v":0}]
["Användningsfas","MWh primärenergi",0,{"$f":"IF(F14=TRUE,(Calc!D182*$C$16)/1000,0)","v":0},{"$f":"IF(F15=TRUE,(Calc!E182*$C$16)/1000,0)","v":0},{"$f":"IF(F16=TRUE,(Calc!F182*$C$16)/1000,0)","v":0},{"$f":"IF(F17=TRUE,(Calc!G182*$C$16)/1000,0)","v":0},{"$f":"IF(F18=TRUE,(Calc!H182*$C$16)/1000,0)","v":0},{"$f":"IF(F19=TRUE,(Calc!I182*$C$16)/1000,0)","v":0},{"$f":"IF(F20=TRUE,(Calc!J182*$C$16)/1000,0)","v":0},{"$f":"IF(F21=TRUE,(Calc!K182*$C$16)/1000,0)","v":0},{"$f":"IF(F22=TRUE,(Calc!L182*$C$16)/1000,0)","v":0}]
["Avfallshantering","MWh primärenergi",0,{"$f":"IF($F$14=TRUE,(SUMPRODUCT(Calc!D5:D10,Calc!D185:D190)+SUMPRODUCT(Calc!D12:D34,Calc!D191:D213))/1000,0)","v":0},{"$f":"IF($F$15=TRUE,(SUMPRODUCT(Calc!E5:E10,Calc!E185:E190)+SUMPRODUCT(Calc!E12:E34,Calc!E191:E213))/1000,0)","v":0},{"$f":"IF($F$16=TRUE,(SUMPRODUCT(Calc!F5:F10,Calc!F185:F190)+SUMPRODUCT(Calc!F12:F34,Calc!F191:F213))/1000,0)","v":0},{"$f":"IF($F$17=TRUE,(SUMPRODUCT(Calc!G5:G10,Calc!G185:G190)+SUMPRODUCT(Calc!G12:G34,Calc!G191:G213))/1000,0)","v":0},{"$f":"IF($F$18=TRUE,(SUMPRODUCT(Calc!H5:H10,Calc!H185:H190)+SUMPRODUCT(Calc!H12:H34,Calc!H191:H213))/1000,0)","v":0},{"$f":"IF($F$19=TRUE,(SUMPRODUCT(Calc!I5:I10,Calc!I185:I190)+SUMPRODUCT(Calc!I12:I34,Calc!I191:I213))/1000,0)","v":0},{"$f":"IF($F$20=TRUE,(SUMPRODUCT(Calc!J5:J10,Calc!J185:J190)+SUMPRODUCT(Calc!J12:J34,Calc!J191:J213))/1000,0)","v":0},{"$f":"IF($F$21=TRUE,(SUMPRODUCT(Calc!K5:K10,Calc!K185:K190)+SUMPRODUCT(Calc!K12:K34,Calc!K191:K213))/1000,0)","v":0},{"$f":"IF($F$22=TRUE,(SUMPRODUCT(Calc!L5:L10,Calc!L185:L190)+SUMPRODUCT(Calc!L12:L34,Calc!L191:L213))/1000,0)","v":0}]
[]
["2.4 Pay-back-tid (miljö)"]
["Klimatpåverkan","år",null,{"$f":"IF($F$14=TRUE,IF(Calc!D75<0,Calc!D140,999),0)","v":0},{"$f":"IF($F$15=TRUE,IF(Calc!E75<0,Calc!E140,999),0)","v":0},{"$f":"IF($F$16=TRUE,IF(Calc!F75<0,Calc!F140,999),0)","v":0},{"$f":"IF($F$17=TRUE,IF(Calc!G75<0,Calc!G140,999),0)","v":0},{"$f":"IF($F$18=TRUE,IF(Calc!H75<0,Calc!H140,999),0)","v":0},{"$f":"IF($F$19=TRUE,IF(Calc!I75<0,Calc!I140,999),0)","v":0},{"$f":"IF($F$20=TRUE,IF(Calc!J75<0,Calc!J140,999),0)","v":0},{"$f":"IF($F$21=TRUE,IF(Calc!K75<0,Calc!K140,999),0)","v":0},{"$f":"IF($F$22=TRUE,IF(Calc!L75<0,Calc!L140,999),0)","v":0}]
["Primärenergi","år",null,{"$f":"IF($F$14=TRUE,IF(Calc!D182<0,Calc!D246,999),0)","v":0},{"$f":"IF($F$15=TRUE,IF(Calc!E182<0,Calc!E246,999),0)","v":0},{"$f":"IF($F$16=TRUE,IF(Calc!F182<0,Calc!F246,999),0)","v":0},{"$f":"IF($F$17=TRUE,IF(Calc!G182<0,Calc!G246,999),0)","v":0},{"$f":"IF($F$18=TRUE,IF(Calc!H182<0,Calc!H246,999),0)","v":0},{"$f":"IF($F$19=TRUE,IF(Calc!I182<0,Calc!I246,999),0)","v":0},{"$f":"IF($F$20=TRUE,IF(Calc!J182<0,Calc!J246,999),0)","v":0},{"$f":"IF($F$21=TRUE,IF(Calc!K182<0,Calc!K246,999),0)","v":0},{"$f":"IF($F$22=TRUE,IF(Calc!L182<0,Calc!L246,999),0)","v":0}]
[null,null,null,"Pay-back-tid större än beräkningsperioden betyder att renoveringen inte ger någon besparing. Pay-back-tid större än någon investerings praktiska livslängd kan innehålla mindre fel. "]
["2.5 Resultatdiagram"]
[]
[]
[]
[]
[]
[]
[]
[]
[]
[]
[]
[]
[]
[]
[]
[]
[]
[]
[]
[]
[]
[]
[]
[]
[]
[]
[]
[]
[]
[]
[]
[]
[]
[]
[]
[]
[]
[]
[]
[null,null,null,null,null,null," "]
["3. Energisystem"]
[null,null,{"$f":"C$24","v":"Referensfall"},{"$f":"D$24","v":""},"","","","","","","",""]
["3.1 Energi för uppvärmning",null,null,"Fylls i för alla alternativ."]
["Uppvärmningsform före renovering:",null,null,1,1,1,1,1,1,1,1,1]
["Uppvärmningsform efter renovering:",null,null,1,1,1,1,1,1,1,1,1]
["Årligt värmebehov efter renovering:","kWh/år"]
[]
["3.2 Byte av uppvärmningsform",null,null,"Fylls i för alternativ där uppvärmningssystem byts."]
["Inkludera byte av uppvärmningsform",null,null,false,false,false,false,false,false,false,false,false]
["Investeringens praktiska livslängd","år",null,{"$f":"INDEX(Defaultvärden!$A$15:$C$21,MATCH(Miljö!D94,Defaultvärden!$A$15:$A$21,0),3)","v":25},{"$f":"INDEX(Defaultvärden!$A$15:$C$21,MATCH(Miljö!E94,Defaultvärden!$A$15:$A$21,0),3)","v":25},{"$f":"INDEX(Defaultvärden!$A$15:$C$21,MATCH(Miljö!F94,Defaultvärden!$A$15:$A$21,0),3)","v":25},{"$f":"INDEX(Defaultvärden!$A$15:$C$21,MATCH(Miljö!G94,Defaultvärden!$A$15:$A$21,0),3)","v":25},{"$f":"INDEX(Defaultvärden!$A$15:$C$21,MATCH(Miljö!H94,Defaultvärden!$A$15:$A$21,0),3)","v":25},{"$f":"INDEX(Defaultvärden!$A$15:$C$21,MATCH(Miljö!I94,Defaultvärden!$A$15:$A$21,0),3)","v":25},{"$f":"INDEX(Defaultvärden!$A$15:$C$21,MATCH(Miljö!J94,Defaultvärden!$A$15:$A$21,0),3)","v":25},{"$f":"INDEX(Defaultvärden!$A$15:$C$21,MATCH(Miljö!K94,Defaultvärden!$A$15:$A$21,0),3)","v":25},{"$f":"INDEX(Defaultvärden!$A$15:$C$21,MATCH(Miljö!L94,Defaultvärden!$A$15:$A$21,0),3)","v":25}]
["Uppvärmningsform före renovering:",null,null,{"$f":"INDEX(Uppvärmning!$A$6:$F$12, MATCH(Miljö!D93,Uppvärmning!$A$6:$A$12, 0),2)","v":"Bergvärmepump"},{"$f":"INDEX(Uppvärmning!$A$6:$F$12, MATCH(Miljö!E93,Uppvärmning!$A$6:$A$12, 0),2)","v":"Bergvärmepump"},{"$f":"INDEX(Uppvärmning!$A$6:$F$12, MATCH(Miljö!F93,Uppvärmning!$A$6:$A$12, 0),2)","v":"Bergvärmepump"},{"$f":"INDEX(Uppvärmning!$A$6:$F$12, MATCH(Miljö!G93,Uppvärmning!$A$6:$A$12, 0),2)","v":"Bergvärmepump"},{"$f":"INDEX(Uppvärmning!$A$6:$F$12, MATCH(Miljö!H93,Uppvärmning!$A$6:$A$12, 0),2)","v":"Bergvärmepump"},{"$f":"INDEX(Uppvärmning!$A$6:$F$12, MATCH(Miljö!I93,Uppvärmning!$A$6:$A$12, 0),2)","v":"Bergvärmepump"},{"$f":"INDEX(Uppvärmning!$A$6:$F$12, MATCH(Miljö!J93,Uppvärmning!$A$6:$A$12, 0),2)","v":"Bergvärmepump"},{"$f":"INDEX(Uppvärmning!$A$6:$F$12, MATCH(Miljö!K93,Uppvärmning!$A$6:$A$12, 0),2)","v":"Bergvärmepump"},{"$f":"INDEX(Uppvärmning!$A$6:$F$12, MATCH(Miljö!L93,Uppvärmning!$A$6:$A$12, 0),2)","v":"Bergvärmepump"}]
["Uppvärmningsform efter renoveringen:",null,null,{"$f":"INDEX(Uppvärmning!$A$6:$F$12, MATCH(Miljö!D94,Uppvärmning!$A$6:$A$12, 0),2)","v":"Bergvärmepump"},{"$f":"INDEX(Uppvärmning!$A$6:$F$12, MATCH(Miljö!E94,Uppvärmning!$A$6:$A$12, 0),2)","v":"Bergvärmepump"},{"$f":"INDEX(Uppvärmning!$A$6:$F$12, MATCH(Miljö!F94,Uppvärmning!$A$6:$A$12, 0),2)","v":"Bergvärmepump"},{"$f":"INDEX(Uppvärmning!$A$6:$F$12, MATCH(Miljö!G94,Uppvärmning!$A$6:$A$12, 0),2)","v":"Bergvärmepump"},{"$f":"INDEX(Uppvärmning!$A$6:$F$12, MATCH(Miljö!H94,Uppvärmning!$A$6:$A$12, 0),2)","v":"Bergvärmepump"},{"$f":"INDEX(Uppvärmning!$A$6:$F$12, MATCH(Miljö!I94,Uppvärmning!$A$6:$A$12, 0),2)","v":"Bergvärmepump"},{"$f":"INDEX(Uppvärmning!$A$6:$F$12, MATCH(Miljö!J94,Uppvärmning!$A$6:$A$12, 0),2)","v":"Bergvärmepump"},{"$f":"INDEX(Uppvärmning!$A$6:$F$12, MATCH(Miljö!K94,Uppvärmning!$A$6:$A$12, 0),2)","v":"Bergvärmepump"},{"$f":"INDEX(Uppvärmning!$A$6:$F$12, MATCH(Miljö!L94,Uppvärmning!$A$6:$A$12, 0),2)","v":"Bergvärmepump"}]
["Dimensionerande värmeeffekt:","kW"]
["Vikt för panna/värmepump/fjärrvärmecentral","kg"]
["Transport till byggplatsen (Ange antal km från fabrik till byggplats för respektive transportslag)"]
["Lastbil","km"]
["Tåg","km"]
["Båt","km"]
["För värmepumpar: Ange borrhålets djup","m"]
[]
["3.3 Cirkulationspump värmesystem",null,null,"Fylls i om cirkulationspump byts ut"]
["Inkludera byte av pump i beräkningarna",null,null,false,false,false,false,false,false,false,false,false]
["Investeringens praktiska livslängd","år",null,{"$f":"Defaultvärden!$C$28","v":12.5},{"$f":"Defaultvärden!$C$28","v":12.5},{"$f":"Defaultvärden!$C$28","v":12.5},{"$f":"Defaultvärden!$C$28","v":12.5},{"$f":"Defaultvärden!$C$28","v":12.5},{"$f":"Defaultvärden!$C$28","v":12.5},{"$f":"Defaultvärden!$C$28","v":12.5},{"$f":"Defaultvärden!$C$28","v":12.5},{"$f":"Defaultvärden!$C$28","v":12.5}]
["Vikt pump","kg"]
["Transport till byggplatsen (Ange antal km från fabrik till byggplats för respektive transportslag)"]
["Lastbil","km"]
["Tåg","km"]
["Båt","km"]
[]
["3.4 Ventilationsaggregat",null,null,"Fylls i om ventilationsaggregat byts ut"]
["Inkludera ventilationsaggregat i beräkningarna",null,null,false,false,false,false,false,false,false,false,false]
["Investeringens praktiska livslängd","år",null,{"$f":"Defaultvärden!$C$30","v":15},{"$f":"Defaultvärden!$C$30","v":15},{"$f":"Defaultvärden!$C$30","v":15},{"$f":"Defaultvärden!$C$30","v":15},{"$f":"Defaultvärden!$C$30","v":15},{"$f":"Defaultvärden!$C$30","v":15},{"$f":"Defaultvärden!$C$30","v":15},{"$f":"Defaultvärden!$C$30","v":15},{"$f":"Defaultvärden!$C$30","v":15}]
["Val av ventilationsaggregat",null,null,1,1,1,1,1,1,1,1,1]
["Dimensionerande luftflöde (frånluft)","m3/h"]
["Transport till byggplatsen (Ange antal km från fabrik till byggplats för respektive transportslag)"]
["Lastbil","km"]
["Tåg","km"]
["Båt","km"]
[]
["3.5 Egenproducerad el",null,null,"Fylls i om ny anläggning för egenproducerad el installeras"]
["Inkludera installation av egenproducerad el i beräkningarna",null,null,false,false,false,false,false,false,false,false,false]
["Investeringens praktiska livslängd","år",null,{"$f":"Defaultvärden!$C$32","v":23},{"$f":"Defaultvärden!$C$32","v":23},{"$f":"Defaultvärden!$C$32","v":23},{"$f":"Defaultvärden!$C$32","v":23},{"$f":"Defaultvärden!$C$32","v":23},{"$f":"Defaultvärden!$C$32","v":23},{"$f":"Defaultvärden!$C$32","v":23},{"$f":"Defaultvärden!$C$32","v":23},{"$f":"Defaultvärden!$C$32","v":23}]
["Val av elproduktionsanläggning",null,null,1,1,1,1,1,1,1,1,1]
["Anläggningens storlek","m2"]
["Årlig egen elproduktion","kWh/år"]
["Transport till byggplatsen (Ange antal km från fabrik till byggplats för respektive transportslag)"]
["Lastbil","km"]
["Tåg","km"]
["Båt","km"]
[]
[]
["4. Ändring i energianvändning"]
[null,null,{"$f":"C$24","v":"Referensfall"},{"$f":"D$24","v":""},"","","","","","","",""]
["4.1  Ändring i energianvändning mot referensfall",null,null,"Ändringar till följd av åtgärder i ventilation, klimatskal, kyla, belysning m.m."]
["Ändring i årligt värmebehov","kWh/år"]
["Ändring i årligt elbehov, exkl ev el till värme","kWh/år"]
[]
[]
["5. Isolering, fönster och dörrar"]
[null,null,{"$f":"C$24","v":"Referensfall"},{"$f":"D$24","v":""},"","","","","","","",""]
["5.1 Isolering material 1 t.ex. fasad (exkl. fasadsystem nedan)",null,null,"Tilläggsisolering av väggar, tak etc."]
["Inkludera ny isolering i beräkningarna",null,null,false,false,false,false,false,false,false,false,false]
["Investeringens praktiska livslängd","år",null,{"$f":"Defaultvärden!$C$35","v":40},{"$f":"Defaultvärden!$C$35","v":40},{"$f":"Defaultvärden!$C$35","v":40},{"$f":"Defaultvärden!$C$35","v":40},{"$f":"Defaultvärden!$C$35","v":40},{"$f":"Defaultvärden!$C$35","v":40},{"$f":"Defaultvärden!$C$35","v":40},{"$f":"Defaultvärden!$C$35","v":40},{"$f":"Defaultvärden!$C$35","v":40}]
["Val av isoleringsmaterial",null,null,1,1,1,1,1,1,1,1,1]
["Antal kg isoleringsmaterial","kg"]
["Transport till byggplatsen (Ange antal km från fabrik till byggplats för respektive transportslag)"]
["Lastbil","km"]
["Tåg","km"]
["Båt","km"]
[]
["5.2 Isolering material 2 t.ex. vind/grund",null,null,"Möjlighet att ange ett andra isoleringsmaterial."]
["Inkludera ny isolering i beräkningarna",null,null,false,false,false,false,false,false,false,false,false]
["Investeringens praktiska livslängd","år",null,{"$f":"Defaultvärden!$C$35","v":40},{"$f":"Defaultvärden!$C$35","v":40},{"$f":"Defaultvärden!$C$35","v":40},{"$f":"Defaultvärden!$C$35","v":40},{"$f":"Defaultvärden!$C$35","v":40},{"$f":"Defaultvärden!$C$35","v":40},{"$f":"Defaultvärden!$C$35","v":40},{"$f":"Defaultvärden!$C$35","v":40},{"$f":"Defaultvärden!$C$35","v":40}]
["Val av isoleringsmaterial",null,null,1,1,1,1,1,1,1,1,1]
["Antal kg isoleringsmaterial","kg"]
["Transport till byggplatsen (Ange antal km från fabrik till byggplats för respektive transportslag)"]
["Lastbil","km"]
["Tåg","km"]
["Båt","km"]
[]
["5.3 Fasadsystem för renovering och tilläggsisolering",null,null,"Prefabricerat fasadsystem inkl. isolering och ytbeläggning"]
["Inkludera nytt fasadsystem i beräkningarna",null,null,false,false,false,false,false,false,false,false,false]
["Investeringens praktiska livslängd","år",null,{"$f":"Defaultvärden!$C$38","v":40},{"$f":"Defaultvärden!$C$38","v":40},{"$f":"Defaultvärden!$C$38","v":40},{"$f":"Defaultvärden!$C$38","v":40},{"$f":"Defaultvärden!$C$38","v":40},{"$f":"Defaultvärden!$C$38","v":40},{"$f":"Defaultvärden!$C$38","v":40},{"$f":"Defaultvärden!$C$38","v":40},{"$f":"Defaultvärden!$C$38","v":40}]
["Val av fasadmaterial",null,null,1,1,1,1,1,1,1,1,1]
["Fasadarea","m2"]
["Transport till byggplatsen (Ange antal km från fabrik till byggplats för respektive transportslag)"]
["Lastbil","km"]
["Tåg","km"]
["Båt","km"]
[]
["5.4 Fönster",null,null,"Kan även inkludera dörrar bestående av mestadels glas såsom balkongdörrar."]
["Inkludera byte av fönster i beräkningarna",null,null,false,false,false,false,false,false,false,false,false]
["Investeringens praktiska livslängd","år",null,{"$f":"Defaultvärden!$C$36","v":40},{"$f":"Defaultvärden!$C$36","v":40},{"$f":"Defaultvärden!$C$36","v":40},{"$f":"Defaultvärden!$C$36","v":40},{"$f":"Defaultvärden!$C$36","v":40},{"$f":"Defaultvärden!$C$36","v":40},{"$f":"Defaultvärden!$C$36","v":40},{"$f":"Defaultvärden!$C$36","v":40},{"$f":"Defaultvärden!$C$36","v":40}]
["Välj typ av fönster",null,null,1,1,1,1,1,1,1,1,1]
["Fönsterarea:","m2"]
["Transport till byggplatsen (Ange antal km från fabrik till byggplats för respektive transportslag)"]
["Lastbil","km"]
["Tåg","km"]
["Båt","km"]
[]
["5.5 Dörrar (ytter- och balkongdörrar)"]
["Inkludera byte av dörrar i beräkningarna",null,null,false,false,false,false,false,false,false,false,false]
["Investeringens praktiska livslängd","år",null,{"$f":"Defaultvärden!$C$37","v":40},{"$f":"Defaultvärden!$C$37","v":40},{"$f":"Defaultvärden!$C$37","v":40},{"$f":"Defaultvärden!$C$37","v":40},{"$f":"Defaultvärden!$C$37","v":40},{"$f":"Defaultvärden!$C$37","v":40},{"$f":"Defaultvärden!$C$37","v":40},{"$f":"Defaultvärden!$C$37","v":40},{"$f":"Defaultvärden!$C$37","v":40}]
["Välj typ av dörr",null,null,1,1,1,1,1,1,1,1,1]
["Antal dörrar","st"]
["Transport till byggplatsen (Ange antal km från fabrik till byggplats för respektive transportslag)"]
["Lastbil","km"]
["Tåg","km"]
["Båt","km"]
[]
[]
["6. Byggmaterial "]
[null,null,{"$f":"C$24","v":"Referensfall"},{"$f":"D$24","v":""},"","","","","","","",""]
["6.1 Trä - konstruktionsvirke"]
["Inkludera byggande av trästruktur i beräkningarna",null,null,false,false,false,false,false,false,false,false,false]
["Investeringens praktiska livslängd","år",null,{"$f":"Defaultvärden!$C$41","v":60},{"$f":"Defaultvärden!$C$41","v":60},{"$f":"Defaultvärden!$C$41","v":60},{"$f":"Defaultvärden!$C$41","v":60},{"$f":"Defaultvärden!$C$41","v":60},{"$f":"Defaultvärden!$C$41","v":60},{"$f":"Defaultvärden!$C$41","v":60},{"$f":"Defaultvärden!$C$41","v":60},{"$f":"Defaultvärden!$C$41","v":60}]
["Mängd - volym ","m3"]
["Transport till byggplatsen (Ange antal km från fabrik till byggplats för respektive transportslag)"]
["Lastbil","km"]
["Tåg","km"]
["Båt","km"]
[]
["6.2 Trä - målad träfasad"]
["Inkludera ny träfasad i beräkningarna",null,null,false,false,false,false,false,false,false,false,false]
["Investeringens praktiska livslängd","år",null,{"$f":"Defaultvärden!$C$42","v":60},{"$f":"Defaultvärden!$C$42","v":60},{"$f":"Defaultvärden!$C$42","v":60},{"$f":"Defaultvärden!$C$42","v":60},{"$f":"Defaultvärden!$C$42","v":60},{"$f":"Defaultvärden!$C$42","v":60},{"$f":"Defaultvärden!$C$42","v":60},{"$f":"Defaultvärden!$C$42","v":60},{"$f":"Defaultvärden!$C$42","v":60}]
["Mängd - väggyta","m2"]
["Transport till byggplatsen (Ange antal km från fabrik till byggplats för respektive transportslag)"]
["Lastbil","km"]
["Tåg","km"]
["Båt","km"]
[]
["6.3 Trä - invändig träpanel"]
["Inkludera ny träfasad i beräkningarna",null,null,false,false,false,false,false,false,false,false,false]
["Investeringens praktiska livslängd","år",null,{"$f":"Defaultvärden!$C$43","v":60},{"$f":"Defaultvärden!$C$43","v":60},{"$f":"Defaultvärden!$C$43","v":60},{"$f":"Defaultvärden!$C$43","v":60},{"$f":"Defaultvärden!$C$43","v":60},{"$f":"Defaultvärden!$C$43","v":60},{"$f":"Defaultvärden!$C$43","v":60},{"$f":"Defaultvärden!$C$43","v":60},{"$f":"Defaultvärden!$C$43","v":60}]
["Mängd - väggyta","m2"]
["Transport till byggplatsen (Ange antal km från fabrik till byggplats för respektive transportslag)"]
["Lastbil","km"]
["Tåg","km"]
["Båt","km"]
[]
["6.4 Betong - bjälklag"]
["Inkludera bjälklag i beräkningarna",null,null,false,false,false,false,false,false,false,false,false]
["Investeringens praktiska livslängd","år",null,{"$f":"Defaultvärden!$C$45","v":80},{"$f":"Defaultvärden!$C$45","v":80},{"$f":"Defaultvärden!$C$45","v":80},{"$f":"Defaultvärden!$C$45","v":80},{"$f":"Defaultvärden!$C$45","v":80},{"$f":"Defaultvärden!$C$45","v":80},{"$f":"Defaultvärden!$C$45","v":80},{"$f":"Defaultvärden!$C$45","v":80},{"$f":"Defaultvärden!$C$45","v":80}]
["Välj typ av bjälklag",null,null,1,1,1,1,1,1,1,1,1]
["Mängd - yta","m2"]
["Transport till byggplatsen (Ange antal km från fabrik till byggplats för respektive transportslag)"]
["Lastbil","km"]
["Tåg","km"]
["Båt","km"]
[]
["6.3 Betong - bärande ytterväggar"]
["Inkludera bärande ytterväggar i beräkningarna",null,null,false,false,false,false,false,false,false,false,false]
["Investeringens praktiska livslängd","år",null,{"$f":"Defaultvärden!$C$46","v":80},{"$f":"Defaultvärden!$C$46","v":80},{"$f":"Defaultvärden!$C$46","v":80},{"$f":"Defaultvärden!$C$46","v":80},{"$f":"Defaultvärden!$C$46","v":80},{"$f":"Defaultvärden!$C$46","v":80},{"$f":"Defaultvärden!$C$46","v":80},{"$f":"Defaultvärden!$C$46","v":80},{"$f":"Defaultvärden!$C$46","v":80}]
["Välj tjocklek på väggar som sandwichelement",null,null,1,1,1,1,1,1,1,1,1]
["Mängd - väggyta","m2"]
["Transport till byggplatsen (Ange antal km från fabrik till byggplats för respektive transportslag)"]
["Lastbil","km"]
["Tåg","km"]
["Båt","km"]
[]
["6.3 Betong - icke bärande ytterväggar"]
["Inkludera icke bärande ytterväggar i beräkningarna",null,null,false,false,false,false,false,false,false,false,false]
["Investeringens praktiska livslängd","år",null,{"$f":"Defaultvärden!$C$47","v":80},{"$f":"Defaultvärden!$C$47","v":80},{"$f":"Defaultvärden!$C$47","v":80},{"$f":"Defaultvärden!$C$47","v":80},{"$f":"Defaultvärden!$C$47","v":80},{"$f":"Defaultvärden!$C$47","v":80},{"$f":"Defaultvärden!$C$47","v":80},{"$f":"Defaultvärden!$C$47","v":80},{"$f":"Defaultvärden!$C$47","v":80}]
["Mängd - väggyta","m2"]
["Transport till byggplatsen (Ange antal km från fabrik till byggplats för respektive transportslag)"]
["Lastbil","km"]
["Tåg","km"]
["Båt","km"]
[]
["6.3 Betong - innerväggar"]
["Inkludera innerväggar av betong i beräkningarna",null,null,false,false,false,false,false,false,false,false,false]
["Investeringens praktiska livslängd","år",null,{"$f":"Defaultvärden!$C$48","v":80},{"$f":"Defaultvärden!$C$48","v":80},{"$f":"Defaultvärden!$C$48","v":80},{"$f":"Defaultvärden!$C$48","v":80},{"$f":"Defaultvärden!$C$48","v":80},{"$f":"Defaultvärden!$C$48","v":80},{"$f":"Defaultvärden!$C$48","v":80},{"$f":"Defaultvärden!$C$48","v":80},{"$f":"Defaultvärden!$C$48","v":80}]
["Välj tjocklek på väggar",null,null,1,1,1,1,1,1,1,1,1]
["Mängd - väggyta","m2"]
["Transport till byggplatsen (Ange antal km från fabrik till byggplats för respektive transportslag)"]
["Lastbil","km"]
["Tåg","km"]
["Båt","km"]
[]
["6.5 Puts"]
["Inkludera puts i beräkningarna",null,null,false,false,false,false,false,false,false,false,false]
["Investeringens praktiska livslängd","år",null,{"$f":"Defaultvärden!$C$50","v":40},{"$f":"Defaultvärden!$C$50","v":40},{"$f":"Defaultvärden!$C$50","v":40},{"$f":"Defaultvärden!$C$50","v":40},{"$f":"Defaultvärden!$C$50","v":40},{"$f":"Defaultvärden!$C$50","v":40},{"$f":"Defaultvärden!$C$50","v":40},{"$f":"Defaultvärden!$C$50","v":40},{"$f":"Defaultvärden!$C$50","v":40}]
["Mängd - yta","m2"]
["Transport till byggplatsen (Ange antal km från fabrik till byggplats för respektive transportslag)"]
["Lastbil","km"]
["Tåg","km"]
["Båt","km"]
[]
["6.6 Gipsskivor"]
["Inkludera gipsskivor i beräkningarna",null,null,false,false,false,false,false,false,false,false,false]
["Investeringens praktiska livslängd","år",null,{"$f":"Defaultvärden!$C$51","v":60},{"$f":"Defaultvärden!$C$51","v":60},{"$f":"Defaultvärden!$C$51","v":60},{"$f":"Defaultvärden!$C$51","v":60},{"$f":"Defaultvärden!$C$51","v":60},{"$f":"Defaultvärden!$C$51","v":60},{"$f":"Defaultvärden!$C$51","v":60},{"$f":"Defaultvärden!$C$51","v":60},{"$f":"Defaultvärden!$C$51","v":60}]
["Mängd - yta","m2"]
["Transport till byggplatsen (Ange antal km från fabrik till byggplats för respektive transportslag)"]
["Lastbil","km"]
["Tåg","km"]
["Båt","km"]
[]
["6.8 Takbeläggning"]
["Inkludera tak i beräkningarna",null,null,false,false,false,false,false,false,false,false,false]
["Investeringens praktiska livslängd","år",null,{"$f":"INDEX(Defaultvärden!$A$53:$C$56,MATCH(Miljö!D290,Defaultvärden!$A$53:$A$56,0),3)","v":60},{"$f":"INDEX(Defaultvärden!$A$53:$C$56,MATCH(Miljö!E290,Defaultvärden!$A$53:$A$56,0),3)","v":60},{"$f":"INDEX(Defaultvärden!$A$53:$C$56,MATCH(Miljö!F290,Defaultvärden!$A$53:$A$56,0),3)","v":60},{"$f":"INDEX(Defaultvärden!$A$53:$C$56,MATCH(Miljö!G290,Defaultvärden!$A$53:$A$56,0),3)","v":60},{"$f":"INDEX(Defaultvärden!$A$53:$C$56,MATCH(Miljö!H290,Defaultvärden!$A$53:$A$56,0),3)","v":60},{"$f":"INDEX(Defaultvärden!$A$53:$C$56,MATCH(Miljö!I290,Defaultvärden!$A$53:$A$56,0),3)","v":60},{"$f":"INDEX(Defaultvärden!$A$53:$C$56,MATCH(Miljö!J290,Defaultvärden!$A$53:$A$56,0),3)","v":60},{"$f":"INDEX(Defaultvärden!$A$53:$C$56,MATCH(Miljö!K290,Defaultvärden!$A$53:$A$56,0),3)","v":60},{"$f":"INDEX(Defaultvärden!$A$53:$C$56,MATCH(Miljö!L290,Defaultvärden!$A$53:$A$56,0),3)","v":60}]
["Välj typ av takbeläggning",null,null,1,1,1,1,1,1,1,1,1]
["Mängd - yta","m2"]
["Transport till byggplatsen (Ange antal km från fabrik till byggplats för respektive transportslag)"]
["Lastbil","km"]
["Tåg","km"]
["Båt","km"]
[]
[]
["7. Distributionssystem för VVS"]
[null,null,{"$f":"C$24","v":"Referensfall"},{"$f":"D$24","v":""},"","","","","","","",""]
["7.1 Radiatorer"]
["Inkludera byte av radiatorer i beräkningarna",null,null,false,false,false,false,false,false,false,false,false]
["Investeringens praktiska livslängd","år",null,{"$f":"INDEX(Defaultvärden!$A$59:$C$60,MATCH(Miljö!D303,Defaultvärden!$A$59:$A$60,0),3)","v":35},{"$f":"INDEX(Defaultvärden!$A$59:$C$60,MATCH(Miljö!E303,Defaultvärden!$A$59:$A$60,0),3)","v":35},{"$f":"INDEX(Defaultvärden!$A$59:$C$60,MATCH(Miljö!F303,Defaultvärden!$A$59:$A$60,0),3)","v":35},{"$f":"INDEX(Defaultvärden!$A$59:$C$60,MATCH(Miljö!G303,Defaultvärden!$A$59:$A$60,0),3)","v":35},{"$f":"INDEX(Defaultvärden!$A$59:$C$60,MATCH(Miljö!H303,Defaultvärden!$A$59:$A$60,0),3)","v":35},{"$f":"INDEX(Defaultvärden!$A$59:$C$60,MATCH(Miljö!I303,Defaultvärden!$A$59:$A$60,0),3)","v":35},{"$f":"INDEX(Defaultvärden!$A$59:$C$60,MATCH(Miljö!J303,Defaultvärden!$A$59:$A$60,0),3)","v":35},{"$f":"INDEX(Defaultvärden!$A$59:$C$60,MATCH(Miljö!K303,Defaultvärden!$A$59:$A$60,0),3)","v":35},{"$f":"INDEX(Defaultvärden!$A$59:$C$60,MATCH(Miljö!L303,Defaultvärden!$A$59:$A$60,0),3)","v":35}]
["Välj typ av radiator",null,null,1,1,1,1,1,1,1,1,1]
["Vikt radiatorer","kg"]
["Transport till byggplatsen (Ange antal km från fabrik till byggplats för respektive transportslag)"]
["Lastbil","km"]
["Tåg","km"]
["Båt","km"]
[]
["7.2 Kopparrör"]
["Inkludera nya kopparrör i beräkningarna",null,null,false,false,false,false,false,false,false,false,false]
["Investeringens praktiska livslängd","år",null,{"$f":"Defaultvärden!$C$62","v":50},{"$f":"Defaultvärden!$C$62","v":50},{"$f":"Defaultvärden!$C$62","v":50},{"$f":"Defaultvärden!$C$62","v":50},{"$f":"Defaultvärden!$C$62","v":50},{"$f":"Defaultvärden!$C$62","v":50},{"$f":"Defaultvärden!$C$62","v":50},{"$f":"Defaultvärden!$C$62","v":50},{"$f":"Defaultvärden!$C$62","v":50}]
["Vikt kopparrör","kg"]
["Transport till byggplatsen (Ange antal km från fabrik till byggplats för respektive transportslag)"]
["Lastbil","km"]
["Tåg","km"]
["Båt","km"]
[]
["7.3 PEX-rör"]
["Inkludera nya PEX-rör i beräkningarna",null,null,false,false,false,false,false,false,false,false,false]
["Investeringens praktiska livslängd",null,null,{"$f":"Defaultvärden!$C$63","v":50},{"$f":"Defaultvärden!$C$63","v":50},{"$f":"Defaultvärden!$C$63","v":50},{"$f":"Defaultvärden!$C$63","v":50},{"$f":"Defaultvärden!$C$63","v":50},{"$f":"Defaultvärden!$C$63","v":50},{"$f":"Defaultvärden!$C$63","v":50},{"$f":"Defaultvärden!$C$63","v":50},{"$f":"Defaultvärden!$C$63","v":50}]
["Vikt PEX-rör","kg"]
["Transport till byggplatsen (Ange antal km från fabrik till byggplats för respektive transportslag)"]
["Lastbil","km"]
["Tåg","km"]
["Båt","km"]
[]
["7.4 PP-rör (polypropenrör)"]
["Inkludera nya PP-rör i beräkningarna",null,null,false,false,false,false,false,false,false,false,false]
["Investeringens praktiska livslängd",null,null,{"$f":"Defaultvärden!$C$64","v":50},{"$f":"Defaultvärden!$C$64","v":50},{"$f":"Defaultvärden!$C$64","v":50},{"$f":"Defaultvärden!$C$64","v":50},{"$f":"Defaultvärden!$C$64","v":50},{"$f":"Defaultvärden!$C$64","v":50},{"$f":"Defaultvärden!$C$64","v":50},{"$f":"Defaultvärden!$C$64","v":50},{"$f":"Defaultvärden!$C$64","v":50}]
["Vikt PP-rör (polypropenrör)","kg"]
["Transport till byggplatsen (Ange antal km från fabrik till byggplats för respektive transportslag)"]
["Lastbil","km"]
["Tåg","km"]
["Båt","km"]
[]
["7.5 Gjutjärnsrör"]
["Inkludera nya järnrör i beräkningarna",null,null,false,false,false,false,false,false,false,false,false]
["Investeringens praktiska livslängd",null,null,{"$f":"Defaultvärden!$C$65","v":50},{"$f":"Defaultvärden!$C$65","v":50},{"$f":"Defaultvärden!$C$65","v":50},{"$f":"Defaultvärden!$C$65","v":50},{"$f":"Defaultvärden!$C$65","v":50},{"$f":"Defaultvärden!$C$65","v":50},{"$f":"Defaultvärden!$C$65","v":50},{"$f":"Defaultvärden!$C$65","v":50},{"$f":"Defaultvärden!$C$65","v":50}]
["Vikt järnrör","kg"]
["Transport till byggplatsen (Ange antal km från fabrik till byggplats för respektive transportslag)"]
["Lastbil","km"]
["Tåg","km"]
["Båt","km"]
[]
["7.6 Galvaniserade stålrör"]
["Inkludera nya stålrör i beräkningarna",null,null,false,false,false,false,false,false,false,false,false]
["Investeringens praktiska livslängd",null,null,{"$f":"Defaultvärden!$C$66","v":50},{"$f":"Defaultvärden!$C$66","v":50},{"$f":"Defaultvärden!$C$66","v":50},{"$f":"Defaultvärden!$C$66","v":50},{"$f":"Defaultvärden!$C$66","v":50},{"$f":"Defaultvärden!$C$66","v":50},{"$f":"Defaultvärden!$C$66","v":50},{"$f":"Defaultvärden!$C$66","v":50},{"$f":"Defaultvärden!$C$66","v":50}]
["Vikt stålrör","kg"]
["Transport till byggplatsen (Ange antal km från fabrik till byggplats för respektive transportslag)"]
["Lastbil","km"]
["Tåg","km"]
["Båt","km"]
[]
["7.7 Relining av rör"]
["Inkludera relining av rör i beräkningarna",null,null,false,false,false,false,false,false,false,false,false]
["Investeringens praktiska livslängd","år",null,{"$f":"Defaultvärden!$C$68","v":35},{"$f":"Defaultvärden!$C$68","v":35},{"$f":"Defaultvärden!$C$68","v":35},{"$f":"Defaultvärden!$C$68","v":35},{"$f":"Defaultvärden!$C$68","v":35},{"$f":"Defaultvärden!$C$68","v":35},{"$f":"Defaultvärden!$C$68","v":35},{"$f":"Defaultvärden!$C$68","v":35},{"$f":"Defaultvärden!$C$68","v":35}]
["Vikt material för relining","kg"]
["Transport till byggplatsen (Ange antal km från fabrik till byggplats för respektive transportslag)"]
["Lastbil","km"]
["Tåg","km"]
["Båt","km"]
[]
["7.8 Ventilationskanaler"]
["Inkludera ventilationskanaler i beräkningarna",null,null,false,false,false,false,false,false,false,false,false]
["Investeringens praktiska livslängd","år",null,{"$f":"Defaultvärden!$C$70","v":50},{"$f":"Defaultvärden!$C$70","v":50},{"$f":"Defaultvärden!$C$70","v":50},{"$f":"Defaultvärden!$C$70","v":50},{"$f":"Defaultvärden!$C$70","v":50},{"$f":"Defaultvärden!$C$70","v":50},{"$f":"Defaultvärden!$C$70","v":50},{"$f":"Defaultvärden!$C$70","v":50},{"$f":"Defaultvärden!$C$70","v":50}]
["Val av material i ventilationskanalen",null,null,1,1,1,1,1,1,1,1,1]
["Vikt ventilationskanaler","kg"]
["Transport till byggplatsen (Ange antal km från fabrik till byggplats för respektive transportslag)"]
["Lastbil","km"]
["Tåg","km"]
["Båt","km"]
[]
["7.9 Don och dämpare för ventilation"]
["Inkludera don och dämpare i beräkningarna",null,null,false,false,false,false,false,false,false,false,false]
["Investeringens praktiska livslängd","år",null,{"$f":"Defaultvärden!$C$71","v":20},{"$f":"Defaultvärden!$C$71","v":20},{"$f":"Defaultvärden!$C$71","v":20},{"$f":"Defaultvärden!$C$71","v":20},{"$f":"Defaultvärden!$C$71","v":20},{"$f":"Defaultvärden!$C$71","v":20},{"$f":"Defaultvärden!$C$71","v":20},{"$f":"Defaultvärden!$C$71","v":20},{"$f":"Defaultvärden!$C$71","v":20}]
["Antal don och dämpare","st"]
["Transport till byggplatsen (Ange antal km från fabrik till byggplats för respektive transportslag)"]
["Lastbil","km"]
["Tåg","km"]
["Båt","km"]
[]
["7.10 Elledningar"]
["Inkludera byte av elledningar i beräkningarna",null,null,false,false,false,false,false,false,false,false,false]
["Investeringens praktiska livslängd","år",null,{"$f":"Defaultvärden!$C$73","v":37.5},{"$f":"Defaultvärden!$C$73","v":37.5},{"$f":"Defaultvärden!$C$73","v":37.5},{"$f":"Defaultvärden!$C$73","v":37.5},{"$f":"Defaultvärden!$C$73","v":37.5},{"$f":"Defaultvärden!$C$73","v":37.5},{"$f":"Defaultvärden!$C$73","v":37.5},{"$f":"Defaultvärden!$C$73","v":37.5},{"$f":"Defaultvärden!$C$73","v":37.5}]
["Mängd elledningar - längd","m"]
["Transport till byggplatsen (Ange antal km från fabrik till byggplats för respektive transportslag)"]
["Lastbil","km"]
["Tåg","km"]
["Båt","km"]
[]
[]
["8. Övrigt, tillägg från extern analys"]
[null,null,{"$f":"C$24","v":"Referensfall"},{"$f":"D$24","v":""},"","","","","","","",""]
["Åtgärder/material som inte ingår ovan"]
["Klimatpåverkan","kg CO2-ekv"]
["Primärenergi","kWh primärenergi"]

{"sheet":"Material","index":4,"n_rows":186,"n_cols":18,"rows_kept":186,"cut":false,"hidden":true,"merged":[[2,3,2,4],[2,5,2,6],[11,3,11,4],[11,5,11,6],[20,3,20,4],[20,5,20,6],[29,3,29,4],[29,5,29,6],[53,3,53,4],[53,5,53,6],[61,3,61,4],[61,5,61,6],[124,3,124,4],[124,5,124,6],[133,3,133,4],[133,5,133,6],[70,3,70,4],[70,5,70,6],[80,3,80,4],[80,5,80,6],[86,3,86,4],[86,5,86,6],[94,3,94,4],[94,5,94,6],[106,3,106,4],[106,5,106,6],[115,3,115,4],[115,5,115,6],[134,13,134,16],[179,3,179,4],[179,5,179,6],[151,3,151,4],[151,5,151,6],[161,3,161,4],[161,5,161,6],[170,3,170,4],[170,5,170,6],[142,3,142,4],[142,5,142,6]]}
["Material"]
[null,null,null,null,null,null,null,"Samma livslängder har kopierats till defaultfliken. Det är de som kopplas till i Indatafliken"]
["Isolering",null,null,"Tillverkning",null,"Avfallshantering"]
["Nr.","Isolermaterial","Vikt","GWP ","PE","GWP ","PE","Livslängd","Underhåll","Källa Tillverkning"]
[null,null,null,"(kg CO2/kg)","(kWh/kg)","(kg CO2/kg)","(kWh/kg)","år"]
[1,"Cellulosafiber",null,0.36698481999999999,2.0710875,-0.18004158004158005,-0.41580041580041582,40,null,"Cellulose fibre, inclusive blowing in, at plant/CH S (of project Ecoinvent system processes)"]
[2,"Glasull",null,1.4938895000000001,13.587087499999999,4.1374920432845318E-3,1.5382983237852747E-2,40,null,"Glass wool mat, at plant/CH S (of project Ecoinvent system processes)"]
[3,"Stenull",null,1.1318296999999999,5.3997019444444438,4.1374920432845318E-3,1.5382983237852747E-2,40,null,"Rock wool, at plant/CH S (of project Ecoinvent system processes)"]
[4,"Cellplast",null,4.6600292000000003,31.66865,1.5116279069767442,-8.8824289405684755,40,null,"Polystyrene foam slab, at plant/RER U (modifierad enbart CO2-blåst, bygger på en Ecoinvent system process)"]
[]
[]
["Fönster",null,null,"Tillverkning",null,"Avfallshantering"]
["Nr.","Fönter","Vikt","GWP ","PE","GWP ","PE","Livslängd",null,"Källa Tillverkning"]
[null,null,"(kg/m2)","(kg CO2/m2)","(kWh/m2)","(kg CO2/m2)","(kWh/m2)","år"]
[1,"Fönster, Al-ram",50.7,486.36356000000001,2277.6071944444443,-12.331851777757572,5.296521778666909,40,null,"Window frame, aluminium, U=1.6 W/m2K, at plant/RER S (of project Ecoinvent system processes)"]
[2,"Fönster, PVC-ram",94.5,244.95407,1609.5663611111111,98.897311046511604,-582.88517441860461,40,null,"Window frame, plastic (PVC), U=1.6 W/m2K, at plant/RER S (of project Ecoinvent system processes)"]
[3,"Fönster, trä/metall-ram",83.4,245.36582000000001,1201.7241111111111,-26.01105194805195,-95.234054834054845,40,null,"Window frame, wood-metal, U=1.6 W/m2K, at plant/RER S (of project Ecoinvent system processes)"]
[4,"Fönster, trä-ram",80.2,130.80849000000001,685.02819444444447,-19.225432900432903,-199.92135642135642,40,null,"Window frame, wood, U=1.5 W/m2K, at plant/RER S (of project Ecoinvent system processes)"]
[]
[]
["Dörr",null,null,"Tillverkning",null,"Avfallshantering"]
["Nr.","Dörr","Vikt","GWP ","PE","GWP ","PE","Livslängd",null,"Källa Tillverkning"]
[null,null,"(kg/st)","(kg CO2/st)","(kWh/st)","(kg CO2/st)","(kWh/st)","år"]
[1,"Dörr trä/aluminium",{"$f":"38.8*1.6","v":62.08},138.86671000000001,618.49388888888882,-30.668236652236651,-124.99111752445086,40,null,"Door, outer, wood-aluminium, at plant/RER S (of project Ecoinvent system processes)"]
[2,"Dörr trä/glas",{"$f":"36.5*1.6","v":58.400000000000006},143.22308000000001,634.24516666666671,-19.869588744588746,-223.19600769600774,40,null,"Door, outer, wood-glass, at plant/RER S (of project Ecoinvent system processes)"]
[3,"Balkongdörr  glas trä-ram",103.5,171,{"$f":"4039/3.6","v":1121.9444444444443},-17.439731331168833,-96.916332972582978,40,null,"EPD NorDan Ntech Balcony security door 105/80 (NEPD 00258E)"]
[4,"Balkongdörr glas trä/alu-ram",106.8,208,{"$f":"4643/3.6","v":1289.7222222222222},-18.867422077922075,-95.119552669552661,40,null,"EPD NorDan Ntech Balcony security door 105/80 (NEPD 00258E)"]
[]
[]
["Fasad",null,null,"Tillverkning",null,"Avfallshantering"]
["Nr.","Fasadsystem","Vikt","GWP ","PE","GWP ","PE","Livslängd",null,"Källa Tillverkning"]
[null,null,"(kg/m2)","(kg CO2/m2)","(kWh/m2)","(kg CO2/m2)","(kWh/m2)","år",null,"Mestadels Ecoinvent, några EPDer"]
[1,"200 EPS/8-15/Ej vent",24.262535,10.33603815287,147.86166816394527,6.3182276677753029,-36.326960278997817,40]
[2,"200 Stenull+PIR/10-15/Ej vent",32.135637499999994,33.533134197527474,202.34951181210636,7.3995857708160608,-42.39618680599245,40]
[3,"80-100 Stenull/4-8/Vent",23.257718666666666,22.90403891647,91.236606253967352,-1.1827975801304285,1.2200110986914923,40]
[4,"80-100 Stenull/10-20/Ej vent",41.189157500000007,16.436878762555555,50.538612061247584,-0.12961691143129953,0.7416641045228245,40]
[5,"80-100 EPS/8-12/Ej vent",25.004999999999999,12.870054778874998,120.4471907878236,4.2544082205823575,-24.115918526934408,40]
[6,"50 Stenull/4-8/Vent",20.790833333333332,25.546610100720006,111.37275005735889,-1.3293805889832326,1.640724340469679,40]
[7,"50 Stenull/20/Ej vent",45.116407500000008,9.6137737640199994,19.707213379839057,-0.37135189063108137,0.89498447723242713,40]
[8,"50 EPS/8-12/Ej vent",23.805,11.9060756248,91.952562772966658,2.2516415577398488,-12.342552854795491,40]
[9]
[10]
[11]
[12]
[13]
[14]
[15]
[16]
[17]
[18]
[19]
[]
[]
["Byggmaterial (stomme mm) Trä",null,null,"Tillverkning",null,"Avfallshantering"]
["Nr.",null,"Vikt","GWP ","PE","GWP ","PE","Livslängd",null,"Källa Tillverkning"]
[null,null,"kg/enhet","(kg CO2/enhet)","(kWh/enhet)","(kg CO2/enhet)","(kWh/enhet)","år"]
[1,"Trä: Konstruktionsvirke (enhet m3)",440,108.66666666666667,3306.5740740740739,{"$f":"MAX(-164.444444444444,-D57)","v":-108.66666666666667},-1876.5432098765432,60,null,"EPD Norge: Genomsnitt av limträbalk/konstruktionsvirke av gran/furu Sørlaminering+Treindustrien+Moelven"]
[2,"Trä: Fasad (målad) (enhet m2)",7.83,1.2100000000000009,56.222222222222221,{"$f":"MAX(-2.92636363636364,-D58)","v":-1.2100000000000009},-33.393939393939398,60,null,"EPD Norge: Treindustrien. Målad träfasad. 19*148 mm. Livslängd 60 år"]
[3,"Trä invändig träpanel enhet m2",6.58,0.78,46,{"$f":"MAX(-2.45919191919192,-D59)","v":-0.78},-28.062850729517397,60,null,"EPD Norge: Solid softwood panelling for interior use. 1 m2 panel dim 14*120 mm / 0,014 m3 / 6,58 kg."]
[null,null,null,null,null,null,null,null,null,"Kommentar avfallshantering: Har gjort antagandet att avfallshanteringen inte kan \"ge tillbaka\" mer CO2 än från produktion - användningen i byggnad kan inte vara klimatnegativ jmf med att använda trä direkt för energi"]
[]
["Byggmaterial (stomme mm) Betongbjälklag (m2)",null,null,"Tillverkning",null,"Avfallshantering"]
["Nr.",null,"Vikt","GWP ","PE","GWP ","PE","Livslängd",null,"Källa Tillverkning"]
[null,null,"kg/enhet","(kg CO2/enhet)","(kWh/enhet)","(kg CO2/enhet)","(kWh/enhet)","år"]
[1,"Betongbjälklag håldäck",278.16000000000003,31.183509366180004,69.551071868444453,1.1508847867600254,4.2789306174411204,80,null,"EPD håldäck + EPD spännarmering"]
[2,"Betongbjälklag homogen",484.70000000000005,52.487509366180007,80.922182979555558,2.005442393380013,7.4561319753872271,80,null,"EPD platsgjutet bjälklag+EPD Celsa stål"]
[3,"Betongbjälklag homogen klimatförbättrad",476,45.887509366179998,77.199960757333329,1.9694462126034371,7.3223000212179077,80,null,"EPD  klimatförbättrad platsgjutet bjälklag+EPD Celsa stål"]
[4]
[]
[]
["Byggmaterial (stomme mm) betongvägg yttervägg sandwichelement",null,null,"Tillverkning",null,"Avfallshantering"]
["Nr.",null,"Vikt","GWP ","PE","GWP ","PE","Livslängd",null,"Källa Tillverkning"]
[null,null,"kg/enhet","(kg CO2/enhet)","(kWh/enhet)","(kg CO2/enhet)","(kWh/enhet)","år"]
[1,"200+75 mm",667.3,79.968773415450002,186.2637907822222,2.7609484404837676,10.265064714619138,80,null,"EPD prefab sandwich+EPD Celsa stål"]
[2,"150+75 mm",548.70000000000005,72.018773415449999,175.87073522666665,2.2702418841502228,8.4406429026098024,80,null,"EPD prefab sandwich+EPD Celsa stål"]
[]
[null,"Yttervägg sandwichelement 80+80 mm, ickebärande",384.52,46.956257805150003,109.85968951999999,1.5909484404837682,5.9150647146191382,80,null,"EPD prefab sandwich+EPD Celsa stål"]
[]
[]
[]
["Byggmaterial (stomme mm) betongvägg innervägg",null,null,"Tillverkning",null,"Avfallshantering"]
["Nr.",null,"Vikt","GWP ","PE","GWP ","PE","Livslängd",null,"Källa Tillverkning"]
[null,null,"kg/enhet","(kg CO2/enhet)","(kWh/enhet)","(kg CO2/enhet)","(kWh/enhet)","år"]
[1,"Innervägg 200 mm",476,45.887509366179998,77.199960757333329,1.9694462126034371,7.3223000212179077,80,null,"EPD klimatförbättrad platsgjutet bjälklag+EPD Celsa stål"]
[2,"Innervägg 150 mm",358.5,34.987509366179992,59.949960757333329,1.4832908975175045,5.5147994907702103,80,null,"EPD klimatförbättrad platsgjutet bjälklag+EPD Celsa stål"]
[]
["Byggmaterial (stomme mm) Puts o gips",null,null,"Tillverkning",null,"Avfallshantering"]
["Nr.",null,"Vikt","GWP ","PE","GWP ","PE","Livslängd",null,"Källa Tillverkning"]
[null,null,"kg/enhet","(kg CO2/enhet)","(kWh/enhet)","(kg CO2/enhet)","(kWh/enhet)","år"]
[null,"Puts (enhet m2)",20,5.4004466679999998,10.24011400629111,8.2749840865690635E-2,0.30765966475705497,40,null,"Ecoinvent 3: Base plaster"]
[null,"Gips: Gipsfiberplatta (enhet m2)",10,3.08,13.380555555555556,4.1374920432845318E-2,0.15382983237852749,60,null,"Ökobau: Gipsfaserplatte nach DIN EN 15283-2 oder ETA"]
[]
[]
[]
["Byggmaterial (stomme mm) Takbeläggning (m2)",null,null,"Tillverkning",null,"Avfallshantering"]
["Nr.",null,"Vikt","GWP ","PE","GWP ","PE","Livslängd",null,"Källa Tillverkning"]
[null,null,"kg/enhet","(kg CO2/enhet)","(kWh/enhet)","(kg CO2/enhet)","(kWh/enhet)","år"]
[1,"Takpannor av tegel",46.6,16.822600000000001,81.135777777777776,0.1928071292170592,0.71684701888393809,60,null,"IBU EPD: Tondachziegel CREATON AG Werk Dorfen/Bayern"]
[2,"Takpannor av betong",45,10.395,26.158888888888889,0.18618714194780392,0.69223424570337366,40,null,"IBU EPD: Betondachstein mit Beschichtung/Eternit Östereich GmbH + Betondachsteine/Dachziegelwerke Nelskamp GmbH"]
[3,"Takpaneler av fibercement",7.4,7.18466,21.788888888888888,3.0617441120305535E-2,0.11383407596011033,30,null,"IBU EPD: Fibre cement slates/Cembrit Holding A/S"]
[4,"Takpapp",6.9749999999999996,4.4225000000000003,80.463888888888889,2.8859007001909607E-2,0.10729630808402291,25,null,"EPD Norge: Medelvärde av fyra typer Bitumen roof"]
[5]
[]
[]
[]
[]
["Ventilationskanaler",null,null,"Tillverkning",null,"Avfallshantering"]
["Nr.","Kanalmaterial","Vikt","GWP ","PE","GWP ","PE","Livslängd",null,"Källa Tillverkning"]
[null,null,null,"(kg CO2/kg)","(kWh/kg)","(kg CO2/kg)","(kWh/kg)","år"]
[1,"Stål",null,4.2280933333333328,20.030992592592593,-0.61428571428571432,0.23809523809523808,50,null,"Ventilation duct, steel, 100x50 mm, at plant/RER S "]
[2,"Polyetenplast",null,2.9731060606060606,26.49824579124579,1.5116279069767442,-8.8824289405684755,50,null,"Ventilation duct, PE corrugated tube, DN 75, at plant/RER S "]
[3]
[4]
[]
[]
["Ventilationsaggregat",null,null,"Tillverkning",null,"Avfallshantering"]
["Nr.","Ventilationsaggregat","Vikt","GWP ","PE","GWP ","PE","Livslängd",null,"Källa Tillverkning"]
[null,null,"kg/(m3/h)","(kg CO2 /(m3/h))","(kWh /(m3/h))","(kg CO2 /(m3/h))","(kWh /(m3/h))","år"]
[1,"Frånluftsaggregat (centralt)",{"$f":"143/900","v":0.15888888888888889},0.89344188888888887,4.1330009259259262,-7.7951059379830864E-2,3.0753387287442025E-2,15,null,"Ventilation equipment, central, 600-1200 m3/h, at plant/RER U"]
[2,"FTX-aggregat (centalt)",{"$f":"C119*2.5","v":0.3972222222222222},{"$f":"D119*2.5","v":2.2336047222222222},{"$f":"E119*2.5","v":10.332502314814816},-0.19487764844957717,7.6883468218605061E-2,15,null,"Miljöpåverkan från FTX agreegatet antags vara 2,5 muliplicerat med miljöpåverkan för frånluftsaggregatet. Uppskattning mha av Svein Ruud 13-11-27"]
[3,"Frånluftsvärmepump",0.36,3.11,7.07,-0.17661638628716925,6.967900336455396E-2,15,null,"Samma som luft-vattenvärmepump"]
[4]
[]
[]
["Övriga ventilationskomponenter",null,null,"Tillverkning",null,"Avfallshantering"]
["Nr.","Övriga ventilationskomponenter","Vikt","GWP ","PE","GWP ","PE","Livslängd",null,"Källa Tillverkning"]
[null,null,"kg/st","(kg CO2/st","(kWh/st)","(kg CO2/st)","(kWh/st)","år"]
[1,"Don och ljuddämpare",{"$f":"35.6/2","v":17.8},{"$f":"111.206198/2","v":55.603099},{"$f":"559.128172222222/2","v":279.56408611111101},{"$f":"-21.8685714285714/2","v":-10.9342857142857},{"$f":"8.47619047619048/2","v":4.2380952380952399},20,null,"Air distribution housing, steel, 120 m3/h, at plant/CH S och Silencer, steel, DN 125, at plant/CH S"]
[2,null,null,null,null,null,null,null,null," "]
[3]
[4]
[]
[]
["Cirkulationspump för värmesystem",null,null,"Tillverkning",null,"Avfallshantering"]
["Nr.",null,"Vikt","GWP ","PE","GWP ","PE","Livslängd",null,"Källa Tillverkning","Referens materialinnehåll:",null,null,"Life Cycle Thinking - the case of Grundfos, Mikkel Thrane and Arne Remmen,\nDepartment of Development and Planning\nAalborg University, Denmark"]
[null,null,null,"(kg CO2/kg)","(kWh/kg)","(kg CO2/kg)","(kWh/kg)","år",null,null,"Referens materialdata: ",null,null,"Cast iron, at plant/RER U",null,null,null,"Ecoinvent"]
[1,"Oreglerad pump",null,5.7833177461139895,28.148761154289005,-0.22388059701492538,0.24875621890547264,15,null,null,null,null,null,"Steel, low-alloyed, at plant/RER U"]
[2,"Varvtalsreglerad pump",null,13.268257999999999,66.794115277777777,-0.22388059701492538,0.24875621890547264,12.5,null,null,null,null,null,"Copper, at regional storage/RER U"]
[3,null,null,null,null,null,null,null,null,null,null,null,null,"Aluminium, production mix, at plant/RER U"]
[4,null,null,null,null,null,null,null,null,null,null,null,null,"Polystyrene, general purpose, GPPS, at plant/RER U"]
[null,null,null,null,null,null,null,null,null,null,null,null,null,"Silicon, electronic grade, at plant/DE U"]
[null,null,null,null,null,null,null,null,null,null,"Materialbehandling:",null,null,"Injection moulding/RER U"]
["Radiatorer",null,null,"Tillverkning",null,"Avfallshantering",null,null,null,null,null,null,null,"Wire drawing, copper/RER U"]
["Nr.",null,"Vikt","GWP ","PE","GWP ","PE","Livslängd",null,"Källa Tillverkning",null,null,null,"Sheet rolling, steel/RER U"]
[null,null,null,"(kg CO2/kg)","(kWh/kg)","(kg CO2/kg)","(kWh/kg)","år",null,null,null,null,null,"Sheet rolling, aluminium/RER U"]
[1,"Vattenburet",null,1.7762244,8.0101858333333329,-0.61428571428571432,0.23809523809523808,35,null,"Materialinnehåll: Epecon Byggvarudeklaration BVD 3 Epecon Modul Compact, 2012. Materialdata: Steel, low-alloyed, at plant/RER U, Coating powder, at plant/RER U"]
[2,"Elradiator",null,1.7041306000000001,9.5929922222222217,-0.23668502170782307,-1.3600009034646281,22.5,null,"Materialinnehåll: Miljödeklaration Radiator PAX 3000"]
[3]
[4]
[]
[]
["Rör för vatten, avlopp och värmedistribution",null,null,"Tillverkning",null,"Avfallshantering"]
["Nr.",null,"Vikt","GWP ","PE","GWP ","PE","Livslängd",null,"Källa Tillverkning"]
[null,null,null,"(kg CO2/kg)","(kWh/kg)","(kg CO2/kg)","(kWh/kg)","år"]
[1,"Kopparrör",null,2.6707692307692308,10.402279202279201,-0.61428571428571432,0.23809523809523808,50,null,"(För vatten) European copper insitute, A ‘cradle-to-gate‘ life-cycle assessment for copper tube"]
[2,"PEX-rör",null,4.2398590155824882,37.02189312116964,1.5116279069767442,-8.8824289405684755,50,null,"(Vattenrör) The European Plastics Pipes and Fittings Association (TEPPFA)/Flemish Institute for Technological Research (VITO) (2011) EPD Environmental Product Declaration - PEX pipe system for hot and cold water in the building"]
[3,"PP-rör",null,4.1882837900603809,40.665076508231408,1.5116279069767442,-8.8824289405684755,50,null,"(Avloppsrör)The European Plastics Pipes and Fittings Association (TEPPFA)/Flemish Institute for Technological Research (VITO) (2011) EPD Environmental Product Declaration - PP pipe system for soil and waste removal from the building"]
[4,"Gjutjärnsrör",null,1.7741983840000002,8.4016174666666679,-0.61428571428571432,0.23809523809523808,50,null,"(För avlopp) Gustavsberg rörsystem (2008), Cast iron, at plant/RER U, Epoxy resin, liquid, at plant/RER U, Degreasing, metal part in alkaline bath/RER U"]
[5,"Galvaniserade stålrör",null,2.6538345120000004,11.722615955555558,-0.61428571428571432,0.23809523809523808,50,null,"(För värme) Geberit product catalogue (2013), Steel, low-alloyed, at plant/RER U, Welding, gas, steel/RER U, Zinc coating,pieces/RER U"]
[]
[]
["Relining",null,null,"Tillverkning",null,"Avfallshantering"]
["Nr.",null,"Vikt","GWP ","PE","GWP ","PE","Livslängd",null,"Källa Tillverkning"]
[null,null,null,"(kg CO2/kg)","(kWh/kg)","(kg CO2/kg)","(kWh/kg)","år"]
[1,"Glasfiberpolyester",null,4.8734041000000001,22.806162777777779,0.60713365801666852,-3.543741786284679,35,null,"Glass fibre reinforced plastic, polyester resin, hand lay-up, at plant/RER U (of project Ecoinvent unit processes)"]
[2,"PUR- och epoxipolyester"]
[3]
[4]
[]
[]
["Elsystem",null,null,"Tillverkning",null,"Avfallshantering"]
["Nr.",null,"Vikt","GWP ","PE","GWP ","PE","Livslängd",null,"Källa Tillverkning"]
[null,null,null,"(kg CO2/m)","(kWh/m)","(kg CO2/m)","(kWh/m)","år"]
[1,"Elledning",0.121,0.4148,{"$f":"(0.7441+7.783)/3.6","v":2.368638888888889},8.7729823920265779E-2,-0.6664480343300111,37.5,null,"Oekobau: Kabel 3 adrig"]
[2]
[3]
[4]
[]
[]
["Egen elproduktion",null,null,"Tillverkning",null,"Avfallshantering"]
["Nr.",null,"Vikt","GWP ","PE","GWP ","PE","Livslängd",null,"Källa Tillverkning"]
[null,null,null,"(kg CO2/m2)","(kWh/m2)","(kg CO2/m2)","(kWh/m2)","år"]
[1,"Solel",14,38.661914000000003,{"$f":"625.14598/3.6","v":173.65166111111111},null,null,23,null,"1 m2 Slanted-roof construction, mounted, on roof/RER/I S (of project Ecoinvent system processes) inkl. avfallshantering"]
[2]
[3]
[4]

{"sheet":"Uppvärmning","index":5,"n_rows":81,"n_cols":13,"rows_kept":81,"cut":false,"hidden":true,"merged":[]}
[]
["Uppvärmning"]
["miljöpåverkan på per kWh uppvärmning"]
["Nr.","Uppvärmning","GWP ","PE","Livslängd","Livslängd kringmaterial borrhål etc"]
[null,null,"(kg CO2-eq/kWh)","(kWh/kWh)","År","År"]
[1,"Bergvärmepump",{"$f":"C11/3.6+F15","v":3.0423006634920636E-2},{"$f":"D11/3.6","v":0.48333333333333334},25,100,"El nordisk mix enl Miljöfaktaboken, SPF 3,6 (test Energimynd), köldmedium R134a enl. SEPEMO"]
[2,"Luft-vattenvärmepump",{"$f":"C11/2.6+F15","v":4.0818305780219777E-2},{"$f":"D11/2.6","v":0.66923076923076918},15,null,"El nordisk mix enl Miljöfaktaboken, SPF 2,6 (test Energimynd), köldmedium R134a enl. SEPEMO"]
[3,"Fjärrvärme",{"$f":"Miljö!C20/1000","v":8.3000000000000004E-2},{"$f":"Miljö!C21","v":0.79},30,50,"Svensk Fjärrvärme (alt. användarens egna uppgifter)"]
[4,"Pelletspanna",{"$f":"0.01984/0.9","v":2.2044444444444443E-2},1.23,25,50,"Miljöfaktaboken"]
[5,"Oljepanna",0.3856,1.48,25,50,"Miljöfaktaboken"]
[6,"Elpanna",9.7299999999999998E-2,1.74,25,null,"Miljöfaktaboken, nordisk mix"]
[7,"Direktel",{"$f":"C11","v":9.7299999999999998E-2},{"$f":"D11","v":1.74},null,null,"Miljöfaktaboken, nordisk mix"]
[]
[]
[null,null,null,null,"Köldmedieutsläpp",3.3952288571428603E-3,"kg CO2-eq/kWh"," köldmedium R134a enl. SEPEMO"]
[null,null,"Verkningsgrad (gammal) oljepanna",0.75]
[null,null,"Verkningsgrad pelletspanna",0.9]
[]
["Installation av ny uppvärmningsanläggning"]
[null,null,"OBS använd delresultat med försiktighet, förhållandet mellan vikt och effekt skiljer mellan olika uppvärmningsformer"]
[null,"Miljöbesparing, byte av uppvärmning",null,{"$f":"Miljö!C24","v":"Referensfall"},{"$f":"Miljö!D24","v":""},{"$f":"Miljö!E24","v":""},{"$f":"Miljö!F24","v":""},{"$f":"Miljö!G24","v":""},{"$f":"Miljö!H24","v":""},{"$f":"Miljö!I24","v":""},{"$f":"Miljö!J24","v":""},{"$f":"Miljö!K24","v":""},{"$f":"Miljö!L24","v":""}]
[null,"Befintlig uppvärmningsform",null,{"$f":"INDEX(Uppvarmning1, MATCH(Miljö!C93,$A$6:$A$12, 0),2)","v":{"$error":"#N/A"}},{"$f":"INDEX(Uppvarmning1, MATCH(Miljö!D93,$A$6:$A$12, 0),2)","v":"Bergvärmepump"},{"$f":"INDEX(Uppvarmning1, MATCH(Miljö!E93,$A$6:$A$12, 0),2)","v":"Bergvärmepump"},{"$f":"INDEX(Uppvarmning1, MATCH(Miljö!F93,$A$6:$A$12, 0),2)","v":"Bergvärmepump"},{"$f":"INDEX(Uppvarmning1, MATCH(Miljö!G93,$A$6:$A$12, 0),2)","v":"Bergvärmepump"},{"$f":"INDEX(Uppvarmning1, MATCH(Miljö!H93,$A$6:$A$12, 0),2)","v":"Bergvärmepump"},{"$f":"INDEX(Uppvarmning1, MATCH(Miljö!I93,$A$6:$A$12, 0),2)","v":"Bergvärmepump"},{"$f":"INDEX(Uppvarmning1, MATCH(Miljö!J93,$A$6:$A$12, 0),2)","v":"Bergvärmepump"},{"$f":"INDEX(Uppvarmning1, MATCH(Miljö!K93,$A$6:$A$12, 0),2)","v":"Bergvärmepump"},{"$f":"INDEX(Uppvarmning1, MATCH(Miljö!L93,$A$6:$A$12, 0),2)","v":"Bergvärmepump"}]
[null,"Ny uppvärmningsform",null,{"$f":"INDEX(Uppvarmning1, MATCH(Miljö!C94,$A$6:$A$12, 0),2)","v":{"$error":"#N/A"}},{"$f":"INDEX(Uppvarmning1, MATCH(Miljö!D94,$A$6:$A$12, 0),2)","v":"Bergvärmepump"},{"$f":"INDEX(Uppvarmning1, MATCH(Miljö!E94,$A$6:$A$12, 0),2)","v":"Bergvärmepump"},{"$f":"INDEX(Uppvarmning1, MATCH(Miljö!F94,$A$6:$A$12, 0),2)","v":"Bergvärmepump"},{"$f":"INDEX(Uppvarmning1, MATCH(Miljö!G94,$A$6:$A$12, 0),2)","v":"Bergvärmepump"},{"$f":"INDEX(Uppvarmning1, MATCH(Miljö!H94,$A$6:$A$12, 0),2)","v":"Bergvärmepump"},{"$f":"INDEX(Uppvarmning1, MATCH(Miljö!I94,$A$6:$A$12, 0),2)","v":"Bergvärmepump"},{"$f":"INDEX(Uppvarmning1, MATCH(Miljö!J94,$A$6:$A$12, 0),2)","v":"Bergvärmepump"},{"$f":"INDEX(Uppvarmning1, MATCH(Miljö!K94,$A$6:$A$12, 0),2)","v":"Bergvärmepump"},{"$f":"INDEX(Uppvarmning1, MATCH(Miljö!L94,$A$6:$A$12, 0),2)","v":"Bergvärmepump"}]
[null,"Vikt","kg",{"$f":"Miljö!C103","v":0},{"$f":"Miljö!D103","v":0},{"$f":"Miljö!E103","v":0},{"$f":"Miljö!F103","v":0},{"$f":"Miljö!G103","v":0},{"$f":"Miljö!H103","v":0},{"$f":"Miljö!I103","v":0},{"$f":"Miljö!J103","v":0},{"$f":"Miljö!K103","v":0},{"$f":"Miljö!L103","v":0}]
[null,"Dimensionerande värmeeffekt:","kW",{"$f":"Miljö!C102","v":0},{"$f":"Miljö!D102","v":0},{"$f":"Miljö!E102","v":0},{"$f":"Miljö!F102","v":0},{"$f":"Miljö!G102","v":0},{"$f":"Miljö!H102","v":0},{"$f":"Miljö!I102","v":0},{"$f":"Miljö!J102","v":0},{"$f":"Miljö!K102","v":0},{"$f":"Miljö!L102","v":0}]
[null,"Djup borrhål","m",{"$f":"Miljö!C108","v":0},{"$f":"Miljö!D108","v":0},{"$f":"Miljö!E108","v":0},{"$f":"Miljö!F108","v":0},{"$f":"Miljö!G108","v":0},{"$f":"Miljö!H108","v":0},{"$f":"Miljö!I108","v":0},{"$f":"Miljö!J108","v":0},{"$f":"Miljö!K108","v":0},{"$f":"Miljö!L108","v":0}]
[null,"Årlig energiförbrukning","kWh",{"$f":"Miljö!C95","v":0},{"$f":"Miljö!D95","v":0},{"$f":"Miljö!E95","v":0},{"$f":"Miljö!F95","v":0},{"$f":"Miljö!G95","v":0},{"$f":"Miljö!H95","v":0},{"$f":"Miljö!I95","v":0},{"$f":"Miljö!J95","v":0},{"$f":"Miljö!K95","v":0},{"$f":"Miljö!L95","v":0}]
[]
["Nr.","Växthuseffekt materialanvändning"]
[1,"Bergvärmepump","kg CO2-eq/st",{"$f":"6.73*D24","v":0},0,0,0,0,0,0,0,0,0]
[2,"Luft-vattenvärmepump","kg CO2-eq/st",{"$f":"8.7*D24","v":0},{"$f":"8.7*E24","v":0},0,0,0,0,0,0,0,{"$f":"8.7*M24","v":0}]
[3,"Fjärrvärme","kg CO2-eq/st",{"$f":"3.4880078*D24","v":0},{"$f":"3.4880078*E24","v":0},0,0,0,0,0,0,0,{"$f":"3.4880078*M24","v":0}]
[4,"Pelletspanna","kg CO2-eq/st",{"$f":"12.361*D25+1049.6","v":1049.5999999999999},{"$f":"12.361*E25+1049.6","v":1049.5999999999999},1049.5999999999999,1049.5999999999999,1049.5999999999999,1049.5999999999999,1049.5999999999999,1049.5999999999999,1049.5999999999999,1049.5999999999999]
[5,"Oljepanna","kg CO2-eq/st",{"$f":"11.95*D25+244.18","v":244.18},{"$f":"11.95*E25+244.18","v":244.18},244.18,244.18,244.18,244.18,244.18,244.18,244.18,{"$f":"11.95*M25+244.18","v":244.18}]
[6,"Elpanna","kg CO2-eq/st",{"$f":"1363.4963*D24/64","v":0},{"$f":"1363.4963*E24/64","v":0},{"$f":"1363.4963*F24/64","v":0},0,0,0,0,0,0,0]
[7,"Direktel","kg CO2-eq/st",0,0,0,0,0,0,0,0,0,0]
["A","Borrhål fär värmepump","kg CO2-eq/st",{"$f":"19.13*D26","v":0},{"$f":"19.13*E26","v":0},0,0,0,0,0,0,0,0]
["B","Anslutning fjv","kg CO2-eq/st",{"$f":"0.0858*D27","v":0},{"$f":"0.0858*E27","v":0},{"$f":"0.0858*F27","v":0},0,0,0,0,0,0,{"$f":"0.0858*M27","v":0}]
["C","Skorsten + pelletsförvaring","kg CO2-eq/st",{"$f":"59.713*D25+671.77","v":671.77},{"$f":"59.713*E25+671.77","v":671.77},671.77,671.77,671.77,671.77,671.77,671.77,671.77,671.77]
["D","Oljetank","kg CO2-eq/st",{"$f":"43.259*D25+540.74","v":540.74},{"$f":"43.259*E25+540.74","v":540.74},540.74,540.74,540.74,540.74,540.74,540.74,540.74,540.74]
[]
["Nr.","Primärenerg materialanvändning"]
[1,"Bergvärmepump","kWh PE/st",{"$f":"8.98*D24","v":0},0,0,0,0,0,0,0,0,0]
[2,"Luft-vattenvärmepump","kWh PE/st",{"$f":"19.77*D24","v":0},{"$f":"19.77*E24","v":0},0,0,0,0,0,0,0,0]
[3,"Fjärrvärme","kWh PE/st",{"$f":"12.4707544444444*D24","v":0},{"$f":"12.4707544444444*E24","v":0},0,0,0,0,0,0,0,{"$f":"12.4707544444444*M24","v":0}]
[4,"Pelletspanna","kWh PE/st",{"$f":"71.925*D25+5328.1","v":5328.1},{"$f":"71.925*E25+5328.1","v":5328.1},{"$f":"71.925*F25+5328.1","v":5328.1},5328.1,5328.1,5328.1,5328.1,5328.1,5328.1,5328.1]
[5,"Oljepanna","kWh PE/st",{"$f":"60.603*D25+1248.8","v":1248.8},{"$f":"60.603*E25+1248.8","v":1248.8},{"$f":"60.603*F25+1248.8","v":1248.8},1248.8,1248.8,1248.8,1248.8,{"$f":"60.603*K25+1248.8","v":1248.8},1248.8,1248.8]
[6,"Elpanna","kWh PE/st",{"$f":"2108.63483333333*D24/64","v":0},{"$f":"2108.63483333333*E24/64","v":0},0,0,0,0,0,0,0,0]
[7,"Direktel","kWh PE/st",0,0,0,0,0,0,0,0,0,0]
["A","Borrhål fär värmepump","kWh PE/st",{"$f":"96.21*D26","v":0},{"$f":"96.21*E26","v":0},0,0,0,0,0,0,0,0]
["B","Anslutning fjv","kWh PE/st",{"$f":"0.348*D27","v":0},0,0,0,0,0,0,0,0,0]
["C","Skorsten + pelletsförvaring","kWh PE/st",{"$f":"91.418*D25+1028.5","v":1028.5},{"$f":"91.418*E25+1028.5","v":1028.5},{"$f":"91.418*F25+1028.5","v":1028.5},1028.5,1028.5,1028.5,1028.5,1028.5,1028.5,1028.5]
["D","Oljetank","kWh PE/st",{"$f":"190.94*D25+2386.8","v":2386.8000000000002},{"$f":"190.94*E25+2386.8","v":2386.8000000000002},2386.8000000000002,2386.8000000000002,2386.8000000000002,2386.8000000000002,{"$f":"190.94*J25+2386.8","v":2386.8000000000002},2386.8000000000002,2386.8000000000002,2386.8000000000002]
[]
[null,"Växthuseffekt drift","Negativa värden indikerar en miljöbesparing"]
[null,"Miljöpåverkan, drift före renovering","kg CO2-eq/kWh",{"$f":"INDEX(Uppvarmning1, MATCH(Miljö!C93,$A$6:$A$12, 0),3)","v":{"$error":"#N/A"}},{"$f":"INDEX(Uppvarmning1, MATCH(Miljö!D93,$A$6:$A$12, 0),3)","v":3.0423006634920636E-2},{"$f":"INDEX(Uppvarmning1, MATCH(Miljö!E93,$A$6:$A$12, 0),3)","v":3.0423006634920636E-2},{"$f":"INDEX(Uppvarmning1, MATCH(Miljö!F93,$A$6:$A$12, 0),3)","v":3.0423006634920636E-2},{"$f":"INDEX(Uppvarmning1, MATCH(Miljö!G93,$A$6:$A$12, 0),3)","v":3.0423006634920636E-2},{"$f":"INDEX(Uppvarmning1, MATCH(Miljö!H93,$A$6:$A$12, 0),3)","v":3.0423006634920636E-2},{"$f":"INDEX(Uppvarmning1, MATCH(Miljö!I93,$A$6:$A$12, 0),3)","v":3.0423006634920636E-2},{"$f":"INDEX(Uppvarmning1, MATCH(Miljö!J93,$A$6:$A$12, 0),3)","v":3.0423006634920636E-2},{"$f":"INDEX(Uppvarmning1, MATCH(Miljö!K93,$A$6:$A$12, 0),3)","v":3.0423006634920636E-2},{"$f":"INDEX(Uppvarmning1, MATCH(Miljö!L93,$A$6:$A$12, 0),3)","v":3.0423006634920636E-2}]
[null,"Miljöpåverkan, drift efter renovering","kg CO2-eq/kWh",{"$f":"INDEX(Uppvarmning1, MATCH(Miljö!C94,$A6:$A12, 0),3)","v":{"$error":"#N/A"}},{"$f":"INDEX(Uppvarmning1, MATCH(Miljö!D94,$A6:$A12, 0),3)","v":3.0423006634920636E-2},{"$f":"INDEX(Uppvarmning1, MATCH(Miljö!E94,$A6:$A12, 0),3)","v":3.0423006634920636E-2},{"$f":"INDEX(Uppvarmning1, MATCH(Miljö!F94,$A6:$A12, 0),3)","v":3.0423006634920636E-2},{"$f":"INDEX(Uppvarmning1, MATCH(Miljö!G94,$A6:$A12, 0),3)","v":3.0423006634920636E-2},{"$f":"INDEX(Uppvarmning1, MATCH(Miljö!H94,$A6:$A12, 0),3)","v":3.0423006634920636E-2},{"$f":"INDEX(Uppvarmning1, MATCH(Miljö!I94,$A6:$A12, 0),3)","v":3.0423006634920636E-2},{"$f":"INDEX(Uppvarmning1, MATCH(Miljö!J94,$A6:$A12, 0),3)","v":3.0423006634920636E-2},{"$f":"INDEX(Uppvarmning1, MATCH(Miljö!K94,$A6:$A12, 0),3)","v":3.0423006634920636E-2},{"$f":"INDEX(Uppvarmning1, MATCH(Miljö!L94,$A6:$A12, 0),3)","v":3.0423006634920636E-2}]
[null,"Ändring","kg CO2-eq/kWh",{"$f":"D57-D56","v":{"$error":"#N/A"}},{"$f":"E57-E56","v":0},0,0,0,0,0,0,0,0]
[]
[null,"Primärenergi drift","Negativa värden indikerar en miljöbesparing"]
[null,"Miljöpåverkan, drift före renovering","(kWh/kWh)",{"$f":"INDEX(Uppvarmning1, MATCH(Miljö!C93,$A6:$A12, 0),4)","v":{"$error":"#N/A"}},{"$f":"INDEX(Uppvarmning1, MATCH(Miljö!D93,$A6:$A12, 0),4)","v":0.48333333333333334},{"$f":"INDEX(Uppvarmning1, MATCH(Miljö!E93,$A6:$A12, 0),4)","v":0.48333333333333334},{"$f":"INDEX(Uppvarmning1, MATCH(Miljö!F93,$A6:$A12, 0),4)","v":0.48333333333333334},{"$f":"INDEX(Uppvarmning1, MATCH(Miljö!G93,$A6:$A12, 0),4)","v":0.48333333333333334},{"$f":"INDEX(Uppvarmning1, MATCH(Miljö!H93,$A6:$A12, 0),4)","v":0.48333333333333334},{"$f":"INDEX(Uppvarmning1, MATCH(Miljö!I93,$A6:$A12, 0),4)","v":0.48333333333333334},{"$f":"INDEX(Uppvarmning1, MATCH(Miljö!J93,$A6:$A12, 0),4)","v":0.48333333333333334},{"$f":"INDEX(Uppvarmning1, MATCH(Miljö!K93,$A6:$A12, 0),4)","v":0.48333333333333334},{"$f":"INDEX(Uppvarmning1, MATCH(Miljö!L93,$A6:$A12, 0),4)","v":0.48333333333333334}]
[null,"Miljöpåverkan, drift efter renovering","(kWh/kWh)",{"$f":"INDEX(Uppvarmning1, MATCH(Miljö!C94,$A6:$A12, 0),4)","v":{"$error":"#N/A"}},{"$f":"INDEX(Uppvarmning1, MATCH(Miljö!D94,$A6:$A12, 0),4)","v":0.48333333333333334},{"$f":"INDEX(Uppvarmning1, MATCH(Miljö!E94,$A6:$A12, 0),4)","v":0.48333333333333334},{"$f":"INDEX(Uppvarmning1, MATCH(Miljö!F94,$A6:$A12, 0),4)","v":0.48333333333333334},{"$f":"INDEX(Uppvarmning1, MATCH(Miljö!G94,$A6:$A12, 0),4)","v":0.48333333333333334},{"$f":"INDEX(Uppvarmning1, MATCH(Miljö!H94,$A6:$A12, 0),4)","v":0.48333333333333334},{"$f":"INDEX(Uppvarmning1, MATCH(Miljö!I94,$A6:$A12, 0),4)","v":0.48333333333333334},{"$f":"INDEX(Uppvarmning1, MATCH(Miljö!J94,$A6:$A12, 0),4)","v":0.48333333333333334},{"$f":"INDEX(Uppvarmning1, MATCH(Miljö!K94,$A6:$A12, 0),4)","v":0.48333333333333334},{"$f":"INDEX(Uppvarmning1, MATCH(Miljö!L94,$A6:$A12, 0),4)","v":0.48333333333333334}]
[null,"Ändring","(kWh/kWh)",{"$f":"D62-D61","v":{"$error":"#N/A"}},{"$f":"E62-E61","v":0},{"$f":"F62-F61","v":0},0,0,0,0,0,0,0]
[]
["Nr.","Växthuseffekt avfallshantering"]
[1,"Bergvärmepump","kg CO2-eq/st",{"$f":"-0.223880597014925*D24","v":0},{"$f":"-0.223880597014925*E24","v":0},0,0,0,0,0,0,0,0]
[2,"Luft-vattenvärmepump","kg CO2-eq/st",{"$f":"-0.223880597014925*D24","v":0},{"$f":"-0.223880597014925*E24","v":0},0,0,0,0,0,0,0,0]
[3,"Fjärrvärme","kg CO2-eq/st",{"$f":"-0.223880597014925*D24","v":0},{"$f":"-0.223880597014925*E24","v":0},0,0,0,0,0,0,0,0]
[4,"Pelletspanna","kg CO2-eq/st",{"$f":"(0.0619*D25+7.3596)             +(-0.223880597014925*(3.14*D25+473))","v":-98.535922388059518},{"$f":"(0.0619*E25+7.3596)             +(-0.223880597014925*(3.14*E25+473))","v":-98.535922388059518},-98.535922388059518,-98.535922388059518,-98.535922388059518,-98.535922388059518,-98.535922388059518,-98.535922388059518,-98.535922388059518,-98.535922388059518]
[5,"Oljepanna","kg CO2-eq/st",{"$f":"(0.0707*D25+11.332)+(-0.223880597014925*(26*D25+350))","v":-67.026208955223751},{"$f":"(0.0707*E25+11.332)   +    (-0.223880597014925*E24)","v":11.332000000000001},11.332000000000001,{"$f":"(0.0707*G25+11.332)   +    (-0.223880597014925*G24)","v":11.332000000000001},11.332000000000001,11.332000000000001,11.332000000000001,11.332000000000001,11.332000000000001,11.332000000000001]
[6,"Elpanna","kg CO2-eq/st",{"$f":"-0.223880597014925*D24","v":0},{"$f":"-0.223880597014925*E24","v":0},0,0,0,0,0,0,0,0]
[7,"Direktel","kg CO2-eq/st",0,0,0,0,0,0,0,0,0,0]
[]
["Nr.","Primärenerg avfallshantering"]
[1,"Bergvärmepump","kWh PE/st",{"$f":"0.248756218905473*D24","v":0},{"$f":"0.248756218905473*E24","v":0},0,0,0,0,0,0,0,{"$f":"0.248756218905473*M24","v":0}]
[2,"Luft-vattenvärmepump","kWh PE/st",{"$f":"0.248756218905473*D24","v":0},{"$f":"0.248756218905473*E24","v":0},0,0,0,0,0,0,0,0]
[3,"Fjärrvärme","kWh PE/st",{"$f":"0.248756218905473*D24","v":0},{"$f":"0.248756218905473*E24","v":0},0,0,{"$f":"0.248756218905473*H24","v":0},0,0,0,{"$f":"0.248756218905473*L24","v":0},0]
[4,"Pelletspanna","kWh PE/st",{"$f":"0.1588*D25+25.275      +    0.248756218905473*(3.14*D25+473)","v":142.93669154228874},{"$f":"0.1588*E25+25.275      +    0.248756218905473*(3.14*E25+473)","v":142.93669154228874},142.93669154228874,142.93669154228874,142.93669154228874,142.93669154228874,142.93669154228874,142.93669154228874,{"$f":"0.1588*L25+25.275      +    0.248756218905473*(3.14*L25+473)","v":142.93669154228874},142.93669154228874]
[5,"Oljepanna","kWh PE/st",{"$f":"0.1057*D25+15.924     +        0.248756218905473*(26*D25+350)","v":102.98867661691554},{"$f":"0.1057*E25+15.924     +        0.248756218905473*(26*E25+350)","v":102.98867661691554},102.98867661691554,102.98867661691554,102.98867661691554,102.98867661691554,102.98867661691554,{"$f":"0.1057*K25+15.924     +        0.248756218905473*(26*K25+350)","v":102.98867661691554},102.98867661691554,102.98867661691554]
[6,"Elpanna","kWh PE/st",{"$f":"0.248756218905473*D24","v":0},{"$f":"0.248756218905473*E24","v":0},0,0,0,0,0,0,0,0]
[7,"Direktel","kWh PE/st",0,0,0,0,0,0,0,0,0,0]

{"sheet":"Trp","index":6,"n_rows":198,"n_cols":12,"rows_kept":198,"cut":false,"hidden":true,"merged":[[8,9,8,12],[3,9,3,12],[4,9,4,12],[5,9,5,12],[6,9,6,12],[7,9,7,12]]}
["Transport"]
[]
["Transport, mijlöpåverkan per tonkilometer"]
["Nr.","Transport","GWP ","PE",null,null,null,null,null,"Källa"]
[null,null,"(kg CO2/tkm)","(kWh/tkm)"]
[1,"Lastbil",0.10548455,0.50609258333333329,null,null,null,null,null,"Transport, lorry >32t, EURO4/RER S (of project Ecoinvent system processes)"]
[2,"Tåg (Nordisk el)",1.7526869E-2,0.14311369722222222,null,null,null,null,null,"Transport, freight, rail/RER U (Modefierad med nordisk el, bygger på Ecoinvent system process)"]
[3,"Båt",4.6309971999999998E-2,0.18173735833333335,null,null,null,null,null,"Transport, barge/RER S (of project Ecoinvent system processes)"]
[4]
[]
[null,null,{"$f":"Miljö!C91","v":"Referensfall"},{"$f":"Miljö!D91","v":""},{"$f":"Miljö!E91","v":""},{"$f":"Miljö!F91","v":""},{"$f":"Miljö!G91","v":""},{"$f":"Miljö!H91","v":""},{"$f":"Miljö!I91","v":""},{"$f":"Miljö!J91","v":""},{"$f":"Miljö!K91","v":""},{"$f":"Miljö!L91","v":""}]
["Vikt"]
["Isolering 1","kg",{"$f":"IF(Miljö!C151=TRUE,  Miljö!C154,0)","v":0},{"$f":"IF(Miljö!D151=TRUE,  Miljö!D154,0)","v":0},{"$f":"IF(Miljö!E151=TRUE,  Miljö!E154,0)","v":0},{"$f":"IF(Miljö!F151=TRUE,  Miljö!F154,0)","v":0},{"$f":"IF(Miljö!G151=TRUE,  Miljö!G154,0)","v":0},{"$f":"IF(Miljö!H151=TRUE,  Miljö!H154,0)","v":0},{"$f":"IF(Miljö!I151=TRUE,  Miljö!I154,0)","v":0},{"$f":"IF(Miljö!J151=TRUE,  Miljö!J154,0)","v":0},{"$f":"IF(Miljö!K151=TRUE,  Miljö!K154,0)","v":0},{"$f":"IF(Miljö!L151=TRUE,  Miljö!L154,0)","v":0}]
["Isolering 2","kg",{"$f":"IF(Miljö!C161=TRUE,  Miljö!C164,0)","v":0},{"$f":"IF(Miljö!D161=TRUE,  Miljö!D164,0)","v":0},{"$f":"IF(Miljö!E161=TRUE,  Miljö!E164,0)","v":0},{"$f":"IF(Miljö!F161=TRUE,  Miljö!F164,0)","v":0},{"$f":"IF(Miljö!G161=TRUE,  Miljö!G164,0)","v":0},{"$f":"IF(Miljö!H161=TRUE,  Miljö!H164,0)","v":0},{"$f":"IF(Miljö!I161=TRUE,  Miljö!I164,0)","v":0},{"$f":"IF(Miljö!J161=TRUE,  Miljö!J164,0)","v":0},{"$f":"IF(Miljö!K161=TRUE,  Miljö!K164,0)","v":0},{"$f":"IF(Miljö!L161=TRUE,  Miljö!L164,0)","v":0}]
["Fasadsystem","kg",{"$f":"IF(Miljö!C171=TRUE,  INDEX(Material!$A33:$G51, MATCH(Miljö!C173,Material!$A33:$A51, 0),3)*Miljö!C174,  0)","v":0},{"$f":"IF(Miljö!D171=TRUE,  INDEX(Material!$A33:$G51, MATCH(Miljö!D173,Material!$A33:$A51, 0),3)*Miljö!D174,  0)","v":0},{"$f":"IF(Miljö!E171=TRUE,  INDEX(Material!$A33:$G51, MATCH(Miljö!E173,Material!$A33:$A51, 0),3)*Miljö!E174,  0)","v":0},{"$f":"IF(Miljö!F171=TRUE,  INDEX(Material!$A33:$G51, MATCH(Miljö!F173,Material!$A33:$A51, 0),3)*Miljö!F174,  0)","v":0},{"$f":"IF(Miljö!G171=TRUE,  INDEX(Material!$A33:$G51, MATCH(Miljö!G173,Material!$A33:$A51, 0),3)*Miljö!G174,  0)","v":0},{"$f":"IF(Miljö!H171=TRUE,  INDEX(Material!$A33:$G51, MATCH(Miljö!H173,Material!$A33:$A51, 0),3)*Miljö!H174,  0)","v":0},{"$f":"IF(Miljö!I171=TRUE,  INDEX(Material!$A33:$G51, MATCH(Miljö!I173,Material!$A33:$A51, 0),3)*Miljö!I174,  0)","v":0},{"$f":"IF(Miljö!J171=TRUE,  INDEX(Material!$A33:$G51, MATCH(Miljö!J173,Material!$A33:$A51, 0),3)*Miljö!J174,  0)","v":0},{"$f":"IF(Miljö!K171=TRUE,  INDEX(Material!$A33:$G51, MATCH(Miljö!K173,Material!$A33:$A51, 0),3)*Miljö!K174,  0)","v":0},{"$f":"IF(Miljö!L171=TRUE,  INDEX(Material!$A33:$G51, MATCH(Miljö!L173,Material!$A33:$A51, 0),3)*Miljö!L174,  0)","v":0}]
["Fönster","kg",{"$f":"IF(Miljö!C181=TRUE,  INDEX(Material!$A15:$G18, MATCH(Miljö!C183,Material!$A15:$A18, 0),3)*Miljö!C184,  0)","v":0},{"$f":"IF(Miljö!D181=TRUE,  INDEX(Material!$A15:$G18, MATCH(Miljö!D183,Material!$A15:$A18, 0),3)*Miljö!D184,  0)","v":0},{"$f":"IF(Miljö!E181=TRUE,  INDEX(Material!$A15:$G18, MATCH(Miljö!E183,Material!$A15:$A18, 0),3)*Miljö!E184,  0)","v":0},{"$f":"IF(Miljö!F181=TRUE,  INDEX(Material!$A15:$G18, MATCH(Miljö!F183,Material!$A15:$A18, 0),3)*Miljö!F184,  0)","v":0},{"$f":"IF(Miljö!G181=TRUE,  INDEX(Material!$A15:$G18, MATCH(Miljö!G183,Material!$A15:$A18, 0),3)*Miljö!G184,  0)","v":0},{"$f":"IF(Miljö!H181=TRUE,  INDEX(Material!$A15:$G18, MATCH(Miljö!H183,Material!$A15:$A18, 0),3)*Miljö!H184,  0)","v":0},{"$f":"IF(Miljö!I181=TRUE,  INDEX(Material!$A15:$G18, MATCH(Miljö!I183,Material!$A15:$A18, 0),3)*Miljö!I184,  0)","v":0},{"$f":"IF(Miljö!J181=TRUE,  INDEX(Material!$A15:$G18, MATCH(Miljö!J183,Material!$A15:$A18, 0),3)*Miljö!J184,  0)","v":0},{"$f":"IF(Miljö!K181=TRUE,  INDEX(Material!$A15:$G18, MATCH(Miljö!K183,Material!$A15:$A18, 0),3)*Miljö!K184,  0)","v":0},{"$f":"IF(Miljö!L181=TRUE,  INDEX(Material!$A15:$G18, MATCH(Miljö!L183,Material!$A15:$A18, 0),3)*Miljö!L184,  0)","v":0}]
["Dörr","kg",{"$f":"IF(Miljö!C191=TRUE,  INDEX(Material!$A24:$G27, MATCH(Miljö!C193,Material!$A15:$A18, 0),3)*Miljö!C194,0)","v":0},{"$f":"IF(Miljö!D191=TRUE,  INDEX(Material!$A24:$G27, MATCH(Miljö!D193,Material!$A15:$A18, 0),3)*Miljö!D194,0)","v":0},{"$f":"IF(Miljö!E191=TRUE,  INDEX(Material!$A24:$G27, MATCH(Miljö!E193,Material!$A15:$A18, 0),3)*Miljö!E194,0)","v":0},{"$f":"IF(Miljö!F191=TRUE,  INDEX(Material!$A24:$G27, MATCH(Miljö!F193,Material!$A15:$A18, 0),3)*Miljö!F194,0)","v":0},{"$f":"IF(Miljö!G191=TRUE,  INDEX(Material!$A24:$G27, MATCH(Miljö!G193,Material!$A15:$A18, 0),3)*Miljö!G194,0)","v":0},{"$f":"IF(Miljö!H191=TRUE,  INDEX(Material!$A24:$G27, MATCH(Miljö!H193,Material!$A15:$A18, 0),3)*Miljö!H194,0)","v":0},{"$f":"IF(Miljö!I191=TRUE,  INDEX(Material!$A24:$G27, MATCH(Miljö!I193,Material!$A15:$A18, 0),3)*Miljö!I194,0)","v":0},{"$f":"IF(Miljö!J191=TRUE,  INDEX(Material!$A24:$G27, MATCH(Miljö!J193,Material!$A15:$A18, 0),3)*Miljö!J194,0)","v":0},{"$f":"IF(Miljö!K191=TRUE,  INDEX(Material!$A24:$G27, MATCH(Miljö!K193,Material!$A15:$A18, 0),3)*Miljö!K194,0)","v":0},{"$f":"IF(Miljö!L191=TRUE,  INDEX(Material!$A24:$G27, MATCH(Miljö!L193,Material!$A15:$A18, 0),3)*Miljö!L194,0)","v":0}]
["Uppvärmning","kg",{"$f":"IF(Miljö!C98=TRUE,  IF(Miljö!C94=6,0,Miljö!C103),0)","v":0},{"$f":"IF(Miljö!D98=TRUE,  IF(Miljö!D94=6,0,Miljö!D103),0)","v":0},{"$f":"IF(Miljö!E98=TRUE,  IF(Miljö!E94=6,0,Miljö!E103),0)","v":0},{"$f":"IF(Miljö!F98=TRUE,  IF(Miljö!F94=6,0,Miljö!F103),0)","v":0},{"$f":"IF(Miljö!G98=TRUE,  IF(Miljö!G94=6,0,Miljö!G103),0)","v":0},{"$f":"IF(Miljö!H98=TRUE,  IF(Miljö!H94=6,0,Miljö!H103),0)","v":0},{"$f":"IF(Miljö!I98=TRUE,  IF(Miljö!I94=6,0,Miljö!I103),0)","v":0},{"$f":"IF(Miljö!J98=TRUE,  IF(Miljö!J94=6,0,Miljö!J103),0)","v":0},{"$f":"IF(Miljö!K98=TRUE,  IF(Miljö!K94=6,0,Miljö!K103),0)","v":0},{"$f":"IF(Miljö!L98=TRUE,  IF(Miljö!L94=6,0,Miljö!L103),0)","v":0}]
["Cirkulationspump","kg",{"$f":"IF(Miljö!C111=TRUE,Miljö!C113,0)","v":0},{"$f":"IF(Miljö!D111=TRUE,Miljö!D113,0)","v":0},{"$f":"IF(Miljö!E111=TRUE,Miljö!E113,0)","v":0},{"$f":"IF(Miljö!F111=TRUE,Miljö!F113,0)","v":0},{"$f":"IF(Miljö!G111=TRUE,Miljö!G113,0)","v":0},{"$f":"IF(Miljö!H111=TRUE,Miljö!H113,0)","v":0},{"$f":"IF(Miljö!I111=TRUE,Miljö!I113,0)","v":0},{"$f":"IF(Miljö!J111=TRUE,Miljö!J113,0)","v":0},{"$f":"IF(Miljö!K111=TRUE,Miljö!K113,0)","v":0},{"$f":"IF(Miljö!L111=TRUE,Miljö!L113,0)","v":0}]
["Vent. kanaler","kg",{"$f":"IF(Miljö!C365=TRUE,   Miljö!C368,0)","v":0},{"$f":"IF(Miljö!D365=TRUE,   Miljö!D368,0)","v":0},{"$f":"IF(Miljö!E365=TRUE,   Miljö!E368,0)","v":0},{"$f":"IF(Miljö!F365=TRUE,   Miljö!F368,0)","v":0},{"$f":"IF(Miljö!G365=TRUE,   Miljö!G368,0)","v":0},{"$f":"IF(Miljö!H365=TRUE,   Miljö!H368,0)","v":0},{"$f":"IF(Miljö!I365=TRUE,   Miljö!I368,0)","v":0},{"$f":"IF(Miljö!J365=TRUE,   Miljö!J368,0)","v":0},{"$f":"IF(Miljö!K365=TRUE,   Miljö!K368,0)","v":0},{"$f":"IF(Miljö!L365=TRUE,   Miljö!L368,0)","v":0}]
["luftflödesaggregat","kg",{"$f":"IF(Miljö!C120=TRUE, INDEX(Material!$A$119:$G$122, MATCH(Miljö!C122,Material!$A$119:$A$122, 0),3)*Miljö!C123,0)","v":0},{"$f":"IF(Miljö!D120=TRUE, INDEX(Material!$A$119:$G$122, MATCH(Miljö!D122,Material!$A$119:$A$122, 0),3)*Miljö!D123,0)","v":0},{"$f":"IF(Miljö!E120=TRUE, INDEX(Material!$A$119:$G$122, MATCH(Miljö!E122,Material!$A$119:$A$122, 0),3)*Miljö!E123,0)","v":0},{"$f":"IF(Miljö!F120=TRUE, INDEX(Material!$A$119:$G$122, MATCH(Miljö!F122,Material!$A$119:$A$122, 0),3)*Miljö!F123,0)","v":0},{"$f":"IF(Miljö!G120=TRUE, INDEX(Material!$A$119:$G$122, MATCH(Miljö!G122,Material!$A$119:$A$122, 0),3)*Miljö!G123,0)","v":0},{"$f":"IF(Miljö!H120=TRUE, INDEX(Material!$A$119:$G$122, MATCH(Miljö!H122,Material!$A$119:$A$122, 0),3)*Miljö!H123,0)","v":0},{"$f":"IF(Miljö!I120=TRUE, INDEX(Material!$A$119:$G$122, MATCH(Miljö!I122,Material!$A$119:$A$122, 0),3)*Miljö!I123,0)","v":0},{"$f":"IF(Miljö!J120=TRUE, INDEX(Material!$A$119:$G$122, MATCH(Miljö!J122,Material!$A$119:$A$122, 0),3)*Miljö!J123,0)","v":0},{"$f":"IF(Miljö!K120=TRUE, INDEX(Material!$A$119:$G$122, MATCH(Miljö!K122,Material!$A$119:$A$122, 0),3)*Miljö!K123,0)","v":0},{"$f":"IF(Miljö!L120=TRUE, INDEX(Material!$A$119:$G$122, MATCH(Miljö!L122,Material!$A$119:$A$122, 0),3)*Miljö!L123,0)","v":0}]
["don och dämpare","kg",{"$f":"IF(Miljö!C375=TRUE, Miljö!C377*Material!$C$128,0)","v":0},{"$f":"IF(Miljö!D375=TRUE, Miljö!D377*Material!$C$128,0)","v":0},{"$f":"IF(Miljö!E375=TRUE, Miljö!E377*Material!$C$128,0)","v":0},{"$f":"IF(Miljö!F375=TRUE, Miljö!F377*Material!$C$128,0)","v":0},{"$f":"IF(Miljö!G375=TRUE, Miljö!G377*Material!$C$128,0)","v":0},{"$f":"IF(Miljö!H375=TRUE, Miljö!H377*Material!$C$128,0)","v":0},{"$f":"IF(Miljö!I375=TRUE, Miljö!I377*Material!$C$128,0)","v":0},{"$f":"IF(Miljö!J375=TRUE, Miljö!J377*Material!$C$128,0)","v":0},{"$f":"IF(Miljö!K375=TRUE, Miljö!K377*Material!$C$128,0)","v":0},{"$f":"IF(Miljö!L375=TRUE, Miljö!L377*Material!$C$128,0)","v":0}]
["solel","kg",{"$f":"IF(Miljö!C130=TRUE,Miljö!C133*Material!$C$183,0)","v":0},{"$f":"IF(Miljö!D130=TRUE,Miljö!D133*Material!$C$183,0)","v":0},{"$f":"IF(Miljö!E130=TRUE,Miljö!E133*Material!$C$183,0)","v":0},{"$f":"IF(Miljö!F130=TRUE,Miljö!F133*Material!$C$183,0)","v":0},{"$f":"IF(Miljö!G130=TRUE,Miljö!G133*Material!$C$183,0)","v":0},{"$f":"IF(Miljö!H130=TRUE,Miljö!H133*Material!$C$183,0)","v":0},{"$f":"IF(Miljö!I130=TRUE,Miljö!I133*Material!$C$183,0)","v":0},{"$f":"IF(Miljö!J130=TRUE,Miljö!J133*Material!$C$183,0)","v":0},{"$f":"IF(Miljö!K130=TRUE,Miljö!K133*Material!$C$183,0)","v":0},{"$f":"IF(Miljö!L130=TRUE,Miljö!L133*Material!$C$183,0)","v":0}]
["Trä konstruktionsvirke","kg",{"$f":"IF(Miljö!C204=TRUE, Miljö!C206*Material!$C$57,0)","v":0},{"$f":"IF(Miljö!D204=TRUE, Miljö!D206*Material!$C$57,0)","v":0},{"$f":"IF(Miljö!E204=TRUE, Miljö!E206*Material!$C$57,0)","v":0},{"$f":"IF(Miljö!F204=TRUE, Miljö!F206*Material!$C$57,0)","v":0},{"$f":"IF(Miljö!G204=TRUE, Miljö!G206*Material!$C$57,0)","v":0},{"$f":"IF(Miljö!H204=TRUE, Miljö!H206*Material!$C$57,0)","v":0},{"$f":"IF(Miljö!I204=TRUE, Miljö!I206*Material!$C$57,0)","v":0},{"$f":"IF(Miljö!J204=TRUE, Miljö!J206*Material!$C$57,0)","v":0},{"$f":"IF(Miljö!K204=TRUE, Miljö!K206*Material!$C$57,0)","v":0},{"$f":"IF(Miljö!L204=TRUE, Miljö!L206*Material!$C$57,0)","v":0}]
["Trä målad träfasad","kg",{"$f":"IF(Miljö!C213=TRUE, Miljö!C215*Material!$C$58,0)","v":0},{"$f":"IF(Miljö!D213=TRUE, Miljö!D215*Material!$C$58,0)","v":0},{"$f":"IF(Miljö!E213=TRUE, Miljö!E215*Material!$C$58,0)","v":0},{"$f":"IF(Miljö!F213=TRUE, Miljö!F215*Material!$C$58,0)","v":0},{"$f":"IF(Miljö!G213=TRUE, Miljö!G215*Material!$C$58,0)","v":0},{"$f":"IF(Miljö!H213=TRUE, Miljö!H215*Material!$C$58,0)","v":0},{"$f":"IF(Miljö!I213=TRUE, Miljö!I215*Material!$C$58,0)","v":0},{"$f":"IF(Miljö!J213=TRUE, Miljö!J215*Material!$C$58,0)","v":0},{"$f":"IF(Miljö!K213=TRUE, Miljö!K215*Material!$C$58,0)","v":0},{"$f":"IF(Miljö!L213=TRUE, Miljö!L215*Material!$C$58,0)","v":0}]
["Trä invändig träpanel","kg",{"$f":"IF(Miljö!C222=TRUE, Miljö!C224*Material!$C$59,0)","v":0},{"$f":"IF(Miljö!D222=TRUE, Miljö!D224*Material!$C$59,0)","v":0},{"$f":"IF(Miljö!E222=TRUE, Miljö!E224*Material!$C$59,0)","v":0},{"$f":"IF(Miljö!F222=TRUE, Miljö!F224*Material!$C$59,0)","v":0},{"$f":"IF(Miljö!G222=TRUE, Miljö!G224*Material!$C$59,0)","v":0},{"$f":"IF(Miljö!H222=TRUE, Miljö!H224*Material!$C$59,0)","v":0},{"$f":"IF(Miljö!I222=TRUE, Miljö!I224*Material!$C$59,0)","v":0},{"$f":"IF(Miljö!J222=TRUE, Miljö!J224*Material!$C$59,0)","v":0},{"$f":"IF(Miljö!K222=TRUE, Miljö!K224*Material!$C$59,0)","v":0},{"$f":"IF(Miljö!L222=TRUE, Miljö!L224*Material!$C$59,0)","v":0}]
["Betong bjälklag","kg",{"$f":"IF(Miljö!C231=TRUE,  INDEX(Material!$A65:$G68, MATCH(Miljö!C233,Material!$A65:$A68, 0),3)*Miljö!C234,  0)","v":0},{"$f":"IF(Miljö!D231=TRUE,  INDEX(Material!$A65:$G68, MATCH(Miljö!D233,Material!$A65:$A68, 0),3)*Miljö!D234,  0)","v":0},{"$f":"IF(Miljö!E231=TRUE,  INDEX(Material!$A65:$G68, MATCH(Miljö!E233,Material!$A65:$A68, 0),3)*Miljö!E234,  0)","v":0},{"$f":"IF(Miljö!F231=TRUE,  INDEX(Material!$A65:$G68, MATCH(Miljö!F233,Material!$A65:$A68, 0),3)*Miljö!F234,  0)","v":0},{"$f":"IF(Miljö!G231=TRUE,  INDEX(Material!$A65:$G68, MATCH(Miljö!G233,Material!$A65:$A68, 0),3)*Miljö!G234,  0)","v":0},{"$f":"IF(Miljö!H231=TRUE,  INDEX(Material!$A65:$G68, MATCH(Miljö!H233,Material!$A65:$A68, 0),3)*Miljö!H234,  0)","v":0},{"$f":"IF(Miljö!I231=TRUE,  INDEX(Material!$A65:$G68, MATCH(Miljö!I233,Material!$A65:$A68, 0),3)*Miljö!I234,  0)","v":0},{"$f":"IF(Miljö!J231=TRUE,  INDEX(Material!$A65:$G68, MATCH(Miljö!J233,Material!$A65:$A68, 0),3)*Miljö!J234,  0)","v":0},{"$f":"IF(Miljö!K231=TRUE,  INDEX(Material!$A65:$G68, MATCH(Miljö!K233,Material!$A65:$A68, 0),3)*Miljö!K234,  0)","v":0},{"$f":"IF(Miljö!L231=TRUE,  INDEX(Material!$A65:$G68, MATCH(Miljö!L233,Material!$A65:$A68, 0),3)*Miljö!L234,  0)","v":0}]
["Betong bärande ytterväggar","kg",{"$f":"IF(Miljö!C241=TRUE,  INDEX(Material!$A74:$G75, MATCH(Miljö!C243,Material!$A74:$A75, 0),3)*Miljö!C244,  0)","v":0},{"$f":"IF(Miljö!D241=TRUE,  INDEX(Material!$A74:$G75, MATCH(Miljö!D243,Material!$A74:$A75, 0),3)*Miljö!D244,  0)","v":0},{"$f":"IF(Miljö!E241=TRUE,  INDEX(Material!$A74:$G75, MATCH(Miljö!E243,Material!$A74:$A75, 0),3)*Miljö!E244,  0)","v":0},{"$f":"IF(Miljö!F241=TRUE,  INDEX(Material!$A74:$G75, MATCH(Miljö!F243,Material!$A74:$A75, 0),3)*Miljö!F244,  0)","v":0},{"$f":"IF(Miljö!G241=TRUE,  INDEX(Material!$A74:$G75, MATCH(Miljö!G243,Material!$A74:$A75, 0),3)*Miljö!G244,  0)","v":0},{"$f":"IF(Miljö!H241=TRUE,  INDEX(Material!$A74:$G75, MATCH(Miljö!H243,Material!$A74:$A75, 0),3)*Miljö!H244,  0)","v":0},{"$f":"IF(Miljö!I241=TRUE,  INDEX(Material!$A74:$G75, MATCH(Miljö!I243,Material!$A74:$A75, 0),3)*Miljö!I244,  0)","v":0},{"$f":"IF(Miljö!J241=TRUE,  INDEX(Material!$A74:$G75, MATCH(Miljö!J243,Material!$A74:$A75, 0),3)*Miljö!J244,  0)","v":0},{"$f":"IF(Miljö!K241=TRUE,  INDEX(Material!$A74:$G75, MATCH(Miljö!K243,Material!$A74:$A75, 0),3)*Miljö!K244,  0)","v":0},{"$f":"IF(Miljö!L241=TRUE,  INDEX(Material!$A74:$G75, MATCH(Miljö!L243,Material!$A74:$A75, 0),3)*Miljö!L244,  0)","v":0}]
["Betong icke-bärande ytterväggar","kg",{"$f":"IF(Miljö!C251=TRUE, Miljö!C253*Material!$C$77,0)","v":0},{"$f":"IF(Miljö!D251=TRUE, Miljö!D253*Material!$C$77,0)","v":0},{"$f":"IF(Miljö!E251=TRUE, Miljö!E253*Material!$C$77,0)","v":0},{"$f":"IF(Miljö!F251=TRUE, Miljö!F253*Material!$C$77,0)","v":0},{"$f":"IF(Miljö!G251=TRUE, Miljö!G253*Material!$C$77,0)","v":0},{"$f":"IF(Miljö!H251=TRUE, Miljö!H253*Material!$C$77,0)","v":0},{"$f":"IF(Miljö!I251=TRUE, Miljö!I253*Material!$C$77,0)","v":0},{"$f":"IF(Miljö!J251=TRUE, Miljö!J253*Material!$C$77,0)","v":0},{"$f":"IF(Miljö!K251=TRUE, Miljö!K253*Material!$C$77,0)","v":0},{"$f":"IF(Miljö!L251=TRUE, Miljö!L253*Material!$C$77,0)","v":0}]
["Betong innerväggar","kg",{"$f":"IF(Miljö!C260=TRUE,  INDEX(Material!$A84:$G85, MATCH(Miljö!C262,Material!$A84:$A85, 0),3)*Miljö!C263,  0)","v":0},{"$f":"IF(Miljö!D260=TRUE,  INDEX(Material!$A84:$G85, MATCH(Miljö!D262,Material!$A84:$A85, 0),3)*Miljö!D263,  0)","v":0},{"$f":"IF(Miljö!E260=TRUE,  INDEX(Material!$A84:$G85, MATCH(Miljö!E262,Material!$A84:$A85, 0),3)*Miljö!E263,  0)","v":0},{"$f":"IF(Miljö!F260=TRUE,  INDEX(Material!$A84:$G85, MATCH(Miljö!F262,Material!$A84:$A85, 0),3)*Miljö!F263,  0)","v":0},{"$f":"IF(Miljö!G260=TRUE,  INDEX(Material!$A84:$G85, MATCH(Miljö!G262,Material!$A84:$A85, 0),3)*Miljö!G263,  0)","v":0},{"$f":"IF(Miljö!H260=TRUE,  INDEX(Material!$A84:$G85, MATCH(Miljö!H262,Material!$A84:$A85, 0),3)*Miljö!H263,  0)","v":0},{"$f":"IF(Miljö!I260=TRUE,  INDEX(Material!$A84:$G85, MATCH(Miljö!I262,Material!$A84:$A85, 0),3)*Miljö!I263,  0)","v":0},{"$f":"IF(Miljö!J260=TRUE,  INDEX(Material!$A84:$G85, MATCH(Miljö!J262,Material!$A84:$A85, 0),3)*Miljö!J263,  0)","v":0},{"$f":"IF(Miljö!K260=TRUE,  INDEX(Material!$A84:$G85, MATCH(Miljö!K262,Material!$A84:$A85, 0),3)*Miljö!K263,  0)","v":0},{"$f":"IF(Miljö!L260=TRUE,  INDEX(Material!$A84:$G85, MATCH(Miljö!L262,Material!$A84:$A85, 0),3)*Miljö!L263,  0)","v":0}]
["Puts","kg",{"$f":"IF(Miljö!C270=TRUE, Miljö!C272*Material!$C$90,0)","v":0},{"$f":"IF(Miljö!D270=TRUE, Miljö!D272*Material!$C$90,0)","v":0},{"$f":"IF(Miljö!E270=TRUE, Miljö!E272*Material!$C$90,0)","v":0},{"$f":"IF(Miljö!F270=TRUE, Miljö!F272*Material!$C$90,0)","v":0},{"$f":"IF(Miljö!G270=TRUE, Miljö!G272*Material!$C$90,0)","v":0},{"$f":"IF(Miljö!H270=TRUE, Miljö!H272*Material!$C$90,0)","v":0},{"$f":"IF(Miljö!I270=TRUE, Miljö!I272*Material!$C$90,0)","v":0},{"$f":"IF(Miljö!J270=TRUE, Miljö!J272*Material!$C$90,0)","v":0},{"$f":"IF(Miljö!K270=TRUE, Miljö!K272*Material!$C$90,0)","v":0},{"$f":"IF(Miljö!L270=TRUE, Miljö!L272*Material!$C$90,0)","v":0}]
["Gipsskivor","kg",{"$f":"IF(Miljö!C279=TRUE, Miljö!C281*Material!$C$91,0)","v":0},{"$f":"IF(Miljö!D279=TRUE, Miljö!D281*Material!$C$91,0)","v":0},{"$f":"IF(Miljö!E279=TRUE, Miljö!E281*Material!$C$91,0)","v":0},{"$f":"IF(Miljö!F279=TRUE, Miljö!F281*Material!$C$91,0)","v":0},{"$f":"IF(Miljö!G279=TRUE, Miljö!G281*Material!$C$91,0)","v":0},{"$f":"IF(Miljö!H279=TRUE, Miljö!H281*Material!$C$91,0)","v":0},{"$f":"IF(Miljö!I279=TRUE, Miljö!I281*Material!$C$91,0)","v":0},{"$f":"IF(Miljö!J279=TRUE, Miljö!J281*Material!$C$91,0)","v":0},{"$f":"IF(Miljö!K279=TRUE, Miljö!K281*Material!$C$91,0)","v":0},{"$f":"IF(Miljö!L279=TRUE, Miljö!L281*Material!$C$91,0)","v":0}]
["Takbeläggning","kg",{"$f":"IF(Miljö!C288=TRUE,  INDEX(Material!$A98:$G102, MATCH(Miljö!C290,Material!$A98:$A102, 0),3)*Miljö!C291,  0)","v":0},{"$f":"IF(Miljö!D288=TRUE,  INDEX(Material!$A98:$G102, MATCH(Miljö!D290,Material!$A98:$A102, 0),3)*Miljö!D291,  0)","v":0},{"$f":"IF(Miljö!E288=TRUE,  INDEX(Material!$A98:$G102, MATCH(Miljö!E290,Material!$A98:$A102, 0),3)*Miljö!E291,  0)","v":0},{"$f":"IF(Miljö!F288=TRUE,  INDEX(Material!$A98:$G102, MATCH(Miljö!F290,Material!$A98:$A102, 0),3)*Miljö!F291,  0)","v":0},{"$f":"IF(Miljö!G288=TRUE,  INDEX(Material!$A98:$G102, MATCH(Miljö!G290,Material!$A98:$A102, 0),3)*Miljö!G291,  0)","v":0},{"$f":"IF(Miljö!H288=TRUE,  INDEX(Material!$A98:$G102, MATCH(Miljö!H290,Material!$A98:$A102, 0),3)*Miljö!H291,  0)","v":0},{"$f":"IF(Miljö!I288=TRUE,  INDEX(Material!$A98:$G102, MATCH(Miljö!I290,Material!$A98:$A102, 0),3)*Miljö!I291,  0)","v":0},{"$f":"IF(Miljö!J288=TRUE,  INDEX(Material!$A98:$G102, MATCH(Miljö!J290,Material!$A98:$A102, 0),3)*Miljö!J291,  0)","v":0},{"$f":"IF(Miljö!K288=TRUE,  INDEX(Material!$A98:$G102, MATCH(Miljö!K290,Material!$A98:$A102, 0),3)*Miljö!K291,  0)","v":0},{"$f":"IF(Miljö!L288=TRUE,  INDEX(Material!$A98:$G102, MATCH(Miljö!L290,Material!$A98:$A102, 0),3)*Miljö!L291,  0)","v":0}]
["Radiatorer","kg",{"$f":"IF(Miljö!C301=TRUE,   Miljö!C304,0)","v":0},{"$f":"IF(Miljö!D301=TRUE,   Miljö!D304,0)","v":0},{"$f":"IF(Miljö!E301=TRUE,   Miljö!E304,0)","v":0},{"$f":"IF(Miljö!F301=TRUE,   Miljö!F304,0)","v":0},{"$f":"IF(Miljö!G301=TRUE,   Miljö!G304,0)","v":0},{"$f":"IF(Miljö!H301=TRUE,   Miljö!H304,0)","v":0},{"$f":"IF(Miljö!I301=TRUE,   Miljö!I304,0)","v":0},{"$f":"IF(Miljö!J301=TRUE,   Miljö!J304,0)","v":0},{"$f":"IF(Miljö!K301=TRUE,   Miljö!K304,0)","v":0},{"$f":"IF(Miljö!L301=TRUE,   Miljö!L304,0)","v":0}]
["Kopparrör","kg",{"$f":"IF(Miljö!C311=TRUE,  Miljö!C313,0)","v":0},{"$f":"IF(Miljö!D311=TRUE,  Miljö!D313,0)","v":0},{"$f":"IF(Miljö!E311=TRUE,  Miljö!E313,0)","v":0},{"$f":"IF(Miljö!F311=TRUE,  Miljö!F313,0)","v":0},{"$f":"IF(Miljö!G311=TRUE,  Miljö!G313,0)","v":0},{"$f":"IF(Miljö!H311=TRUE,  Miljö!H313,0)","v":0},{"$f":"IF(Miljö!I311=TRUE,  Miljö!I313,0)","v":0},{"$f":"IF(Miljö!J311=TRUE,  Miljö!J313,0)","v":0},{"$f":"IF(Miljö!K311=TRUE,  Miljö!K313,0)","v":0},{"$f":"IF(Miljö!L311=TRUE,  Miljö!L313,0)","v":0}]
["PEX-rör","kg",{"$f":"IF(Miljö!C320=TRUE,   Miljö!C322,0)","v":0},{"$f":"IF(Miljö!D320=TRUE,   Miljö!D322,0)","v":0},{"$f":"IF(Miljö!E320=TRUE,   Miljö!E322,0)","v":0},{"$f":"IF(Miljö!F320=TRUE,   Miljö!F322,0)","v":0},{"$f":"IF(Miljö!G320=TRUE,   Miljö!G322,0)","v":0},{"$f":"IF(Miljö!H320=TRUE,   Miljö!H322,0)","v":0},{"$f":"IF(Miljö!I320=TRUE,   Miljö!I322,0)","v":0},{"$f":"IF(Miljö!J320=TRUE,   Miljö!J322,0)","v":0},{"$f":"IF(Miljö!K320=TRUE,   Miljö!K322,0)","v":0},{"$f":"IF(Miljö!L320=TRUE,   Miljö!L322,0)","v":0}]
["PP-rör","kg",{"$f":"IF(Miljö!C329=TRUE,   Miljö!C331,  0)","v":0},{"$f":"IF(Miljö!D329=TRUE,   Miljö!D331,  0)","v":0},{"$f":"IF(Miljö!E329=TRUE,   Miljö!E331,  0)","v":0},{"$f":"IF(Miljö!F329=TRUE,   Miljö!F331,  0)","v":0},{"$f":"IF(Miljö!G329=TRUE,   Miljö!G331,  0)","v":0},{"$f":"IF(Miljö!H329=TRUE,   Miljö!H331,  0)","v":0},{"$f":"IF(Miljö!I329=TRUE,   Miljö!I331,  0)","v":0},{"$f":"IF(Miljö!J329=TRUE,   Miljö!J331,  0)","v":0},{"$f":"IF(Miljö!K329=TRUE,   Miljö!K331,  0)","v":0},{"$f":"IF(Miljö!L329=TRUE,   Miljö!L331,  0)","v":0}]
["Järnrör","kg",{"$f":"IF(Miljö!C338=TRUE,   Miljö!C340,0)","v":0},{"$f":"IF(Miljö!D338=TRUE,   Miljö!D340,0)","v":0},{"$f":"IF(Miljö!E338=TRUE,   Miljö!E340,0)","v":0},{"$f":"IF(Miljö!F338=TRUE,   Miljö!F340,0)","v":0},{"$f":"IF(Miljö!G338=TRUE,   Miljö!G340,0)","v":0},{"$f":"IF(Miljö!H338=TRUE,   Miljö!H340,0)","v":0},{"$f":"IF(Miljö!I338=TRUE,   Miljö!I340,0)","v":0},{"$f":"IF(Miljö!J338=TRUE,   Miljö!J340,0)","v":0},{"$f":"IF(Miljö!K338=TRUE,   Miljö!K340,0)","v":0},{"$f":"IF(Miljö!L338=TRUE,   Miljö!L340,0)","v":0}]
["Stålrör","kg",{"$f":"IF(Miljö!C347=TRUE,   Miljö!C349,  0)","v":0},{"$f":"IF(Miljö!D347=TRUE,   Miljö!D349,  0)","v":0},{"$f":"IF(Miljö!E347=TRUE,   Miljö!E349,  0)","v":0},{"$f":"IF(Miljö!F347=TRUE,   Miljö!F349,  0)","v":0},{"$f":"IF(Miljö!G347=TRUE,   Miljö!G349,  0)","v":0},{"$f":"IF(Miljö!H347=TRUE,   Miljö!H349,  0)","v":0},{"$f":"IF(Miljö!I347=TRUE,   Miljö!I349,  0)","v":0},{"$f":"IF(Miljö!J347=TRUE,   Miljö!J349,  0)","v":0},{"$f":"IF(Miljö!K347=TRUE,   Miljö!K349,  0)","v":0},{"$f":"IF(Miljö!L347=TRUE,   Miljö!L349,  0)","v":0}]
["Relining","kg",{"$f":"IF(Miljö!C356=TRUE,   Miljö!C358,   0)","v":0},{"$f":"IF(Miljö!D356=TRUE,   Miljö!D358,   0)","v":0},{"$f":"IF(Miljö!E356=TRUE,   Miljö!E358,   0)","v":0},{"$f":"IF(Miljö!F356=TRUE,   Miljö!F358,   0)","v":0},{"$f":"IF(Miljö!G356=TRUE,   Miljö!G358,   0)","v":0},{"$f":"IF(Miljö!H356=TRUE,   Miljö!H358,   0)","v":0},{"$f":"IF(Miljö!I356=TRUE,   Miljö!I358,   0)","v":0},{"$f":"IF(Miljö!J356=TRUE,   Miljö!J358,   0)","v":0},{"$f":"IF(Miljö!K356=TRUE,   Miljö!K358,   0)","v":0},{"$f":"IF(Miljö!L356=TRUE,   Miljö!L358,   0)","v":0}]
["Elledning","kg",{"$f":"IF(Miljö!C384=TRUE,   Miljö!C386*Material!$C$174,  0)","v":0},{"$f":"IF(Miljö!D384=TRUE,   Miljö!D386*Material!$C$174,  0)","v":0},{"$f":"IF(Miljö!E384=TRUE,   Miljö!E386*Material!$C$174,  0)","v":0},{"$f":"IF(Miljö!F384=TRUE,   Miljö!F386*Material!$C$174,  0)","v":0},{"$f":"IF(Miljö!G384=TRUE,   Miljö!G386*Material!$C$174,  0)","v":0},{"$f":"IF(Miljö!H384=TRUE,   Miljö!H386*Material!$C$174,  0)","v":0},{"$f":"IF(Miljö!I384=TRUE,   Miljö!I386*Material!$C$174,  0)","v":0},{"$f":"IF(Miljö!J384=TRUE,   Miljö!J386*Material!$C$174,  0)","v":0},{"$f":"IF(Miljö!K384=TRUE,   Miljö!K386*Material!$C$174,  0)","v":0},{"$f":"IF(Miljö!L384=TRUE,   Miljö!L386*Material!$C$174,  0)","v":0}]
[]
["Avstånd"]
["Lastbil, isolering 1","km",{"$f":"Miljö!C156","v":0},{"$f":"Miljö!D156","v":0},{"$f":"Miljö!E156","v":0},{"$f":"Miljö!F156","v":0},{"$f":"Miljö!G156","v":0},{"$f":"Miljö!H156","v":0},{"$f":"Miljö!I156","v":0},{"$f":"Miljö!J156","v":0},{"$f":"Miljö!K156","v":0},{"$f":"Miljö!L156","v":0}]
["Tåg, isolering 1","km",{"$f":"Miljö!C157","v":0},{"$f":"Miljö!D157","v":0},{"$f":"Miljö!E157","v":0},{"$f":"Miljö!F157","v":0},{"$f":"Miljö!G157","v":0},{"$f":"Miljö!H157","v":0},{"$f":"Miljö!I157","v":0},{"$f":"Miljö!J157","v":0},{"$f":"Miljö!K157","v":0},{"$f":"Miljö!L157","v":0}]
["Båt, isolering 1","km",{"$f":"Miljö!C158","v":0},{"$f":"Miljö!D158","v":0},{"$f":"Miljö!E158","v":0},{"$f":"Miljö!F158","v":0},{"$f":"Miljö!G158","v":0},{"$f":"Miljö!H158","v":0},{"$f":"Miljö!I158","v":0},{"$f":"Miljö!J158","v":0},{"$f":"Miljö!K158","v":0},{"$f":"Miljö!L158","v":0}]
["Lastbil, isolering 2","km",{"$f":"Miljö!C166","v":0},{"$f":"Miljö!D166","v":0},{"$f":"Miljö!E166","v":0},{"$f":"Miljö!F166","v":0},{"$f":"Miljö!G166","v":0},{"$f":"Miljö!H166","v":0},{"$f":"Miljö!I166","v":0},{"$f":"Miljö!J166","v":0},{"$f":"Miljö!K166","v":0},{"$f":"Miljö!L166","v":0}]
["Tåg, isolering 2","km",{"$f":"Miljö!C167","v":0},{"$f":"Miljö!D167","v":0},{"$f":"Miljö!E167","v":0},{"$f":"Miljö!F167","v":0},{"$f":"Miljö!G167","v":0},{"$f":"Miljö!H167","v":0},{"$f":"Miljö!I167","v":0},{"$f":"Miljö!J167","v":0},{"$f":"Miljö!K167","v":0},{"$f":"Miljö!L167","v":0}]
["Båt, isolering 2","km",{"$f":"Miljö!C168","v":0},{"$f":"Miljö!D168","v":0},{"$f":"Miljö!E168","v":0},{"$f":"Miljö!F168","v":0},{"$f":"Miljö!G168","v":0},{"$f":"Miljö!H168","v":0},{"$f":"Miljö!I168","v":0},{"$f":"Miljö!J168","v":0},{"$f":"Miljö!K168","v":0},{"$f":"Miljö!L168","v":0}]
["Lastbil, fasad","km",{"$f":"Miljö!C176","v":0},{"$f":"Miljö!D176","v":0},{"$f":"Miljö!E176","v":0},{"$f":"Miljö!F176","v":0},{"$f":"Miljö!G176","v":0},{"$f":"Miljö!H176","v":0},{"$f":"Miljö!I176","v":0},{"$f":"Miljö!J176","v":0},{"$f":"Miljö!K176","v":0},{"$f":"Miljö!L176","v":0}]
["Tåg, fasad","km",{"$f":"Miljö!C177","v":0},{"$f":"Miljö!D177","v":0},{"$f":"Miljö!E177","v":0},{"$f":"Miljö!F177","v":0},{"$f":"Miljö!G177","v":0},{"$f":"Miljö!H177","v":0},{"$f":"Miljö!I177","v":0},{"$f":"Miljö!J177","v":0},{"$f":"Miljö!K177","v":0},{"$f":"Miljö!L177","v":0}]
["Båt, fasad","km",{"$f":"Miljö!C178","v":0},{"$f":"Miljö!D178","v":0},{"$f":"Miljö!E178","v":0},{"$f":"Miljö!F178","v":0},{"$f":"Miljö!G178","v":0},{"$f":"Miljö!H178","v":0},{"$f":"Miljö!I178","v":0},{"$f":"Miljö!J178","v":0},{"$f":"Miljö!K178","v":0},{"$f":"Miljö!L178","v":0}]
["Lastbil, fönster","km",{"$f":"Miljö!C186","v":0},{"$f":"Miljö!D186","v":0},{"$f":"Miljö!E186","v":0},{"$f":"Miljö!F186","v":0},{"$f":"Miljö!G186","v":0},{"$f":"Miljö!H186","v":0},{"$f":"Miljö!I186","v":0},{"$f":"Miljö!J186","v":0},{"$f":"Miljö!K186","v":0},{"$f":"Miljö!L186","v":0}]
["Tåg, fönster","km",{"$f":"Miljö!C187","v":0},{"$f":"Miljö!D187","v":0},{"$f":"Miljö!E187","v":0},{"$f":"Miljö!F187","v":0},{"$f":"Miljö!G187","v":0},{"$f":"Miljö!H187","v":0},{"$f":"Miljö!I187","v":0},{"$f":"Miljö!J187","v":0},{"$f":"Miljö!K187","v":0},{"$f":"Miljö!L187","v":0}]
["Båt, fönster","km",{"$f":"Miljö!C188","v":0},{"$f":"Miljö!D188","v":0},{"$f":"Miljö!E188","v":0},{"$f":"Miljö!F188","v":0},{"$f":"Miljö!G188","v":0},{"$f":"Miljö!H188","v":0},{"$f":"Miljö!I188","v":0},{"$f":"Miljö!J188","v":0},{"$f":"Miljö!K188","v":0},{"$f":"Miljö!L188","v":0}]
["Lastbil, dörrar","km",{"$f":"Miljö!C196","v":0},{"$f":"Miljö!D196","v":0},{"$f":"Miljö!E196","v":0},{"$f":"Miljö!F196","v":0},{"$f":"Miljö!G196","v":0},{"$f":"Miljö!H196","v":0},{"$f":"Miljö!I196","v":0},{"$f":"Miljö!J196","v":0},{"$f":"Miljö!K196","v":0},{"$f":"Miljö!L196","v":0}]
["Tåg, dörrar","km",{"$f":"Miljö!C197","v":0},{"$f":"Miljö!D197","v":0},{"$f":"Miljö!E197","v":0},{"$f":"Miljö!F197","v":0},{"$f":"Miljö!G197","v":0},{"$f":"Miljö!H197","v":0},{"$f":"Miljö!I197","v":0},{"$f":"Miljö!J197","v":0},{"$f":"Miljö!K197","v":0},{"$f":"Miljö!L197","v":0}]
["Båt, dörrar","km",{"$f":"Miljö!C198","v":0},{"$f":"Miljö!D198","v":0},{"$f":"Miljö!E198","v":0},{"$f":"Miljö!F198","v":0},{"$f":"Miljö!G198","v":0},{"$f":"Miljö!H198","v":0},{"$f":"Miljö!I198","v":0},{"$f":"Miljö!J198","v":0},{"$f":"Miljö!K198","v":0},{"$f":"Miljö!L198","v":0}]
["Lastbil, uppvärmning","km",{"$f":"Miljö!C105","v":0},{"$f":"Miljö!D105","v":0},{"$f":"Miljö!E105","v":0},{"$f":"Miljö!F105","v":0},{"$f":"Miljö!G105","v":0},{"$f":"Miljö!H105","v":0},{"$f":"Miljö!I105","v":0},{"$f":"Miljö!J105","v":0},{"$f":"Miljö!K105","v":0},{"$f":"Miljö!L105","v":0}]
["Tåg, uppvärmning","km",{"$f":"Miljö!C106","v":0},{"$f":"Miljö!D106","v":0},{"$f":"Miljö!E106","v":0},{"$f":"Miljö!F106","v":0},{"$f":"Miljö!G106","v":0},{"$f":"Miljö!H106","v":0},{"$f":"Miljö!I106","v":0},{"$f":"Miljö!J106","v":0},{"$f":"Miljö!K106","v":0},{"$f":"Miljö!L106","v":0}]
["Båt, uppvärmning","km",{"$f":"Miljö!C107","v":0},{"$f":"Miljö!D107","v":0},{"$f":"Miljö!E107","v":0},{"$f":"Miljö!F107","v":0},{"$f":"Miljö!G107","v":0},{"$f":"Miljö!H107","v":0},{"$f":"Miljö!I107","v":0},{"$f":"Miljö!J107","v":0},{"$f":"Miljö!K107","v":0},{"$f":"Miljö!L107","v":0}]
["Lastbil, cirk.pump","km",{"$f":"Miljö!C115","v":0},{"$f":"Miljö!D115","v":0},{"$f":"Miljö!E115","v":0},{"$f":"Miljö!F115","v":0},{"$f":"Miljö!G115","v":0},{"$f":"Miljö!H115","v":0},{"$f":"Miljö!I115","v":0},{"$f":"Miljö!J115","v":0},{"$f":"Miljö!K115","v":0},{"$f":"Miljö!L115","v":0}]
["Tåg, cirk.pump","km",{"$f":"Miljö!C116","v":0},{"$f":"Miljö!D116","v":0},{"$f":"Miljö!E116","v":0},{"$f":"Miljö!F116","v":0},{"$f":"Miljö!G116","v":0},{"$f":"Miljö!H116","v":0},{"$f":"Miljö!I116","v":0},{"$f":"Miljö!J116","v":0},{"$f":"Miljö!K116","v":0},{"$f":"Miljö!L116","v":0}]
["Båt, cirk.pump","km",{"$f":"Miljö!C117","v":0},{"$f":"Miljö!D117","v":0},{"$f":"Miljö!E117","v":0},{"$f":"Miljö!F117","v":0},{"$f":"Miljö!G117","v":0},{"$f":"Miljö!H117","v":0},{"$f":"Miljö!I117","v":0},{"$f":"Miljö!J117","v":0},{"$f":"Miljö!K117","v":0},{"$f":"Miljö!L117","v":0}]
["Lastbil, vent kanaler","km",{"$f":"Miljö!C370","v":0},{"$f":"Miljö!D370","v":0},{"$f":"Miljö!E370","v":0},{"$f":"Miljö!F370","v":0},{"$f":"Miljö!G370","v":0},{"$f":"Miljö!H370","v":0},{"$f":"Miljö!I370","v":0},{"$f":"Miljö!J370","v":0},{"$f":"Miljö!K370","v":0},{"$f":"Miljö!L370","v":0}]
["Tåg, vent kanaler","km",{"$f":"Miljö!C371","v":0},{"$f":"Miljö!D371","v":0},{"$f":"Miljö!E371","v":0},{"$f":"Miljö!F371","v":0},{"$f":"Miljö!G371","v":0},{"$f":"Miljö!H371","v":0},{"$f":"Miljö!I371","v":0},{"$f":"Miljö!J371","v":0},{"$f":"Miljö!K371","v":0},{"$f":"Miljö!L371","v":0}]
["Båt, vent kanaler","km",{"$f":"Miljö!C372","v":0},{"$f":"Miljö!D372","v":0},{"$f":"Miljö!E372","v":0},{"$f":"Miljö!F372","v":0},{"$f":"Miljö!G372","v":0},{"$f":"Miljö!H372","v":0},{"$f":"Miljö!I372","v":0},{"$f":"Miljö!J372","v":0},{"$f":"Miljö!K372","v":0},{"$f":"Miljö!L372","v":0}]
["Lastbil, luftflödesaggregat","km",{"$f":"Miljö!C125","v":0},{"$f":"Miljö!D125","v":0},{"$f":"Miljö!E125","v":0},{"$f":"Miljö!F125","v":0},{"$f":"Miljö!G125","v":0},{"$f":"Miljö!H125","v":0},{"$f":"Miljö!I125","v":0},{"$f":"Miljö!J125","v":0},{"$f":"Miljö!K125","v":0},{"$f":"Miljö!L125","v":0}]
["Tåg, luftflödsaggregat","km",{"$f":"Miljö!C126","v":0},{"$f":"Miljö!D126","v":0},{"$f":"Miljö!E126","v":0},{"$f":"Miljö!F126","v":0},{"$f":"Miljö!G126","v":0},{"$f":"Miljö!H126","v":0},{"$f":"Miljö!I126","v":0},{"$f":"Miljö!J126","v":0},{"$f":"Miljö!K126","v":0},{"$f":"Miljö!L126","v":0}]
["Båt, luftflödesaggregat","km",{"$f":"Miljö!C127","v":0},{"$f":"Miljö!D127","v":0},{"$f":"Miljö!E127","v":0},{"$f":"Miljö!F127","v":0},{"$f":"Miljö!G127","v":0},{"$f":"Miljö!H127","v":0},{"$f":"Miljö!I127","v":0},{"$f":"Miljö!J127","v":0},{"$f":"Miljö!K127","v":0},{"$f":"Miljö!L127","v":0}]
["Lastbil, don och dämpare","km",{"$f":"Miljö!C379","v":0},{"$f":"Miljö!D379","v":0},{"$f":"Miljö!E379","v":0},{"$f":"Miljö!F379","v":0},{"$f":"Miljö!G379","v":0},{"$f":"Miljö!H379","v":0},{"$f":"Miljö!I379","v":0},{"$f":"Miljö!J379","v":0},{"$f":"Miljö!K379","v":0},{"$f":"Miljö!L379","v":0}]
["Tåg, don och dämpare","km",{"$f":"Miljö!C380","v":0},{"$f":"Miljö!D380","v":0},{"$f":"Miljö!E380","v":0},{"$f":"Miljö!F380","v":0},{"$f":"Miljö!G380","v":0},{"$f":"Miljö!H380","v":0},{"$f":"Miljö!I380","v":0},{"$f":"Miljö!J380","v":0},{"$f":"Miljö!K380","v":0},{"$f":"Miljö!L380","v":0}]
["Båt, don och dämpare","km",{"$f":"Miljö!C381","v":0},{"$f":"Miljö!D381","v":0},{"$f":"Miljö!E381","v":0},{"$f":"Miljö!F381","v":0},{"$f":"Miljö!G381","v":0},{"$f":"Miljö!H381","v":0},{"$f":"Miljö!I381","v":0},{"$f":"Miljö!J381","v":0},{"$f":"Miljö!K381","v":0},{"$f":"Miljö!L381","v":0}]
["Lastbil, solel","km",{"$f":"Miljö!C136","v":0},{"$f":"Miljö!D136","v":0},{"$f":"Miljö!E136","v":0},{"$f":"Miljö!F136","v":0},{"$f":"Miljö!G136","v":0},{"$f":"Miljö!H136","v":0},{"$f":"Miljö!I136","v":0},{"$f":"Miljö!J136","v":0},{"$f":"Miljö!K136","v":0},{"$f":"Miljö!L136","v":0}]
["Tåg, solel","km",{"$f":"Miljö!C137","v":0},{"$f":"Miljö!D137","v":0},{"$f":"Miljö!E137","v":0},{"$f":"Miljö!F137","v":0},{"$f":"Miljö!G137","v":0},{"$f":"Miljö!H137","v":0},{"$f":"Miljö!I137","v":0},{"$f":"Miljö!J137","v":0},{"$f":"Miljö!K137","v":0},{"$f":"Miljö!L137","v":0}]
["Båt, solel","km",{"$f":"Miljö!C138","v":0},{"$f":"Miljö!D138","v":0},{"$f":"Miljö!E138","v":0},{"$f":"Miljö!F138","v":0},{"$f":"Miljö!G138","v":0},{"$f":"Miljö!H138","v":0},{"$f":"Miljö!I138","v":0},{"$f":"Miljö!J138","v":0},{"$f":"Miljö!K138","v":0},{"$f":"Miljö!L138","v":0}]
["Lastbil, trä konstruktionsvirke","km",{"$f":"Miljö!C208","v":0},{"$f":"Miljö!D208","v":0},{"$f":"Miljö!E208","v":0},{"$f":"Miljö!F208","v":0},{"$f":"Miljö!G208","v":0},{"$f":"Miljö!H208","v":0},{"$f":"Miljö!I208","v":0},{"$f":"Miljö!J208","v":0},{"$f":"Miljö!K208","v":0},{"$f":"Miljö!L208","v":0}]
["Tåg, trä konstruktionsvirke","km",{"$f":"Miljö!C209","v":0},{"$f":"Miljö!D209","v":0},{"$f":"Miljö!E209","v":0},{"$f":"Miljö!F209","v":0},{"$f":"Miljö!G209","v":0},{"$f":"Miljö!H209","v":0},{"$f":"Miljö!I209","v":0},{"$f":"Miljö!J209","v":0},{"$f":"Miljö!K209","v":0},{"$f":"Miljö!L209","v":0}]
["Båt, trä konstruktionsvirke","km",{"$f":"Miljö!C210","v":0},{"$f":"Miljö!D210","v":0},{"$f":"Miljö!E210","v":0},{"$f":"Miljö!F210","v":0},{"$f":"Miljö!G210","v":0},{"$f":"Miljö!H210","v":0},{"$f":"Miljö!I210","v":0},{"$f":"Miljö!J210","v":0},{"$f":"Miljö!K210","v":0},{"$f":"Miljö!L210","v":0}]
["Lastbil, träfasad","km",{"$f":"Miljö!C217","v":0},{"$f":"Miljö!D217","v":0},{"$f":"Miljö!E217","v":0},{"$f":"Miljö!F217","v":0},{"$f":"Miljö!G217","v":0},{"$f":"Miljö!H217","v":0},{"$f":"Miljö!I217","v":0},{"$f":"Miljö!J217","v":0},{"$f":"Miljö!K217","v":0},{"$f":"Miljö!L217","v":0}]
["Tåg, träfasad","km",{"$f":"Miljö!C218","v":0},{"$f":"Miljö!D218","v":0},{"$f":"Miljö!E218","v":0},{"$f":"Miljö!F218","v":0},{"$f":"Miljö!G218","v":0},{"$f":"Miljö!H218","v":0},{"$f":"Miljö!I218","v":0},{"$f":"Miljö!J218","v":0},{"$f":"Miljö!K218","v":0},{"$f":"Miljö!L218","v":0}]
["Båt, träfasad","km",{"$f":"Miljö!C219","v":0},{"$f":"Miljö!D219","v":0},{"$f":"Miljö!E219","v":0},{"$f":"Miljö!F219","v":0},{"$f":"Miljö!G219","v":0},{"$f":"Miljö!H219","v":0},{"$f":"Miljö!I219","v":0},{"$f":"Miljö!J219","v":0},{"$f":"Miljö!K219","v":0},{"$f":"Miljö!L219","v":0}]
["Lastbil, invändig träpanel","km",{"$f":"Miljö!C226","v":0},{"$f":"Miljö!D226","v":0},{"$f":"Miljö!E226","v":0},{"$f":"Miljö!F226","v":0},{"$f":"Miljö!G226","v":0},{"$f":"Miljö!H226","v":0},{"$f":"Miljö!I226","v":0},{"$f":"Miljö!J226","v":0},{"$f":"Miljö!K226","v":0},{"$f":"Miljö!L226","v":0}]
["Tåg, invändig träpanel","km",{"$f":"Miljö!C227","v":0},{"$f":"Miljö!D227","v":0},{"$f":"Miljö!E227","v":0},{"$f":"Miljö!F227","v":0},{"$f":"Miljö!G227","v":0},{"$f":"Miljö!H227","v":0},{"$f":"Miljö!I227","v":0},{"$f":"Miljö!J227","v":0},{"$f":"Miljö!K227","v":0},{"$f":"Miljö!L227","v":0}]
["Båt, invändig träpanel","km",{"$f":"Miljö!C228","v":0},{"$f":"Miljö!D228","v":0},{"$f":"Miljö!E228","v":0},{"$f":"Miljö!F228","v":0},{"$f":"Miljö!G228","v":0},{"$f":"Miljö!H228","v":0},{"$f":"Miljö!I228","v":0},{"$f":"Miljö!J228","v":0},{"$f":"Miljö!K228","v":0},{"$f":"Miljö!L228","v":0}]
["Lastbil, Betong bjälklag","km",{"$f":"Miljö!C236","v":0},{"$f":"Miljö!D236","v":0},{"$f":"Miljö!E236","v":0},{"$f":"Miljö!F236","v":0},{"$f":"Miljö!G236","v":0},{"$f":"Miljö!H236","v":0},{"$f":"Miljö!I236","v":0},{"$f":"Miljö!J236","v":0},{"$f":"Miljö!K236","v":0},{"$f":"Miljö!L236","v":0}]
["Tåg, Betong bjälklag","km",{"$f":"Miljö!C237","v":0},{"$f":"Miljö!D237","v":0},{"$f":"Miljö!E237","v":0},{"$f":"Miljö!F237","v":0},{"$f":"Miljö!G237","v":0},{"$f":"Miljö!H237","v":0},{"$f":"Miljö!I237","v":0},{"$f":"Miljö!J237","v":0},{"$f":"Miljö!K237","v":0},{"$f":"Miljö!L237","v":0}]
["Båt, Betong bjälklag","km",{"$f":"Miljö!C238","v":0},{"$f":"Miljö!D238","v":0},{"$f":"Miljö!E238","v":0},{"$f":"Miljö!F238","v":0},{"$f":"Miljö!G238","v":0},{"$f":"Miljö!H238","v":0},{"$f":"Miljö!I238","v":0},{"$f":"Miljö!J238","v":0},{"$f":"Miljö!K238","v":0},{"$f":"Miljö!L238","v":0}]
["Lastbil,Betong bärande ytterväggar","km",{"$f":"Miljö!C246","v":0},{"$f":"Miljö!D246","v":0},{"$f":"Miljö!E246","v":0},{"$f":"Miljö!F246","v":0},{"$f":"Miljö!G246","v":0},{"$f":"Miljö!H246","v":0},{"$f":"Miljö!I246","v":0},{"$f":"Miljö!J246","v":0},{"$f":"Miljö!K246","v":0},{"$f":"Miljö!L246","v":0}]
["Tåg, Betong bärande ytterväggar","km",{"$f":"Miljö!C247","v":0},{"$f":"Miljö!D247","v":0},{"$f":"Miljö!E247","v":0},{"$f":"Miljö!F247","v":0},{"$f":"Miljö!G247","v":0},{"$f":"Miljö!H247","v":0},{"$f":"Miljö!I247","v":0},{"$f":"Miljö!J247","v":0},{"$f":"Miljö!K247","v":0},{"$f":"Miljö!L247","v":0}]
["Båt,Betong bärande ytterväggar","km",{"$f":"Miljö!C248","v":0},{"$f":"Miljö!D248","v":0},{"$f":"Miljö!E248","v":0},{"$f":"Miljö!F248","v":0},{"$f":"Miljö!G248","v":0},{"$f":"Miljö!H248","v":0},{"$f":"Miljö!I248","v":0},{"$f":"Miljö!J248","v":0},{"$f":"Miljö!K248","v":0},{"$f":"Miljö!L248","v":0}]
["Lastbil, Betong icke-bärande ytterväggar","km",{"$f":"Miljö!C255","v":0},{"$f":"Miljö!D255","v":0},{"$f":"Miljö!E255","v":0},{"$f":"Miljö!F255","v":0},{"$f":"Miljö!G255","v":0},{"$f":"Miljö!H255","v":0},{"$f":"Miljö!I255","v":0},{"$f":"Miljö!J255","v":0},{"$f":"Miljö!K255","v":0},{"$f":"Miljö!L255","v":0}]
["Tåg, Betong icke-bärande ytterväggar","km",{"$f":"Miljö!C256","v":0},{"$f":"Miljö!D256","v":0},{"$f":"Miljö!E256","v":0},{"$f":"Miljö!F256","v":0},{"$f":"Miljö!G256","v":0},{"$f":"Miljö!H256","v":0},{"$f":"Miljö!I256","v":0},{"$f":"Miljö!J256","v":0},{"$f":"Miljö!K256","v":0},{"$f":"Miljö!L256","v":0}]
["Båt, Betong icke-bärande ytterväggar","km",{"$f":"Miljö!C257","v":0},{"$f":"Miljö!D257","v":0},{"$f":"Miljö!E257","v":0},{"$f":"Miljö!F257","v":0},{"$f":"Miljö!G257","v":0},{"$f":"Miljö!H257","v":0},{"$f":"Miljö!I257","v":0},{"$f":"Miljö!J257","v":0},{"$f":"Miljö!K257","v":0},{"$f":"Miljö!L257","v":0}]
["Lastbil, Betong innerväggar","km",{"$f":"Miljö!C265","v":0},{"$f":"Miljö!D265","v":0},{"$f":"Miljö!E265","v":0},{"$f":"Miljö!F265","v":0},{"$f":"Miljö!G265","v":0},{"$f":"Miljö!H265","v":0},{"$f":"Miljö!I265","v":0},{"$f":"Miljö!J265","v":0},{"$f":"Miljö!K265","v":0},{"$f":"Miljö!L265","v":0}]
["Tåg, Betong innerväggar","km",{"$f":"Miljö!C266","v":0},{"$f":"Miljö!D266","v":0},{"$f":"Miljö!E266","v":0},{"$f":"Miljö!F266","v":0},{"$f":"Miljö!G266","v":0},{"$f":"Miljö!H266","v":0},{"$f":"Miljö!I266","v":0},{"$f":"Miljö!J266","v":0},{"$f":"Miljö!K266","v":0},{"$f":"Miljö!L266","v":0}]
["Båt, Betong innerväggar","km",{"$f":"Miljö!C267","v":0},{"$f":"Miljö!D267","v":0},{"$f":"Miljö!E267","v":0},{"$f":"Miljö!F267","v":0},{"$f":"Miljö!G267","v":0},{"$f":"Miljö!H267","v":0},{"$f":"Miljö!I267","v":0},{"$f":"Miljö!J267","v":0},{"$f":"Miljö!K267","v":0},{"$f":"Miljö!L267","v":0}]
["Lastbil, Puts","km",{"$f":"Miljö!C274","v":0},{"$f":"Miljö!D274","v":0},{"$f":"Miljö!E274","v":0},{"$f":"Miljö!F274","v":0},{"$f":"Miljö!G274","v":0},{"$f":"Miljö!H274","v":0},{"$f":"Miljö!I274","v":0},{"$f":"Miljö!J274","v":0},{"$f":"Miljö!K274","v":0},{"$f":"Miljö!L274","v":0}]
["Tåg, Puts","km",{"$f":"Miljö!C275","v":0},{"$f":"Miljö!D275","v":0},{"$f":"Miljö!E275","v":0},{"$f":"Miljö!F275","v":0},{"$f":"Miljö!G275","v":0},{"$f":"Miljö!H275","v":0},{"$f":"Miljö!I275","v":0},{"$f":"Miljö!J275","v":0},{"$f":"Miljö!K275","v":0},{"$f":"Miljö!L275","v":0}]
["Båt, Puts","km",{"$f":"Miljö!C276","v":0},{"$f":"Miljö!D276","v":0},{"$f":"Miljö!E276","v":0},{"$f":"Miljö!F276","v":0},{"$f":"Miljö!G276","v":0},{"$f":"Miljö!H276","v":0},{"$f":"Miljö!I276","v":0},{"$f":"Miljö!J276","v":0},{"$f":"Miljö!K276","v":0},{"$f":"Miljö!L276","v":0}]
["Lastbil, gipsskivor","km",{"$f":"Miljö!C283","v":0},{"$f":"Miljö!D283","v":0},{"$f":"Miljö!E283","v":0},{"$f":"Miljö!F283","v":0},{"$f":"Miljö!G283","v":0},{"$f":"Miljö!H283","v":0},{"$f":"Miljö!I283","v":0},{"$f":"Miljö!J283","v":0},{"$f":"Miljö!K283","v":0},{"$f":"Miljö!L283","v":0}]
["Tåg, gipsskivor","km",{"$f":"Miljö!C284","v":0},{"$f":"Miljö!D284","v":0},{"$f":"Miljö!E284","v":0},{"$f":"Miljö!F284","v":0},{"$f":"Miljö!G284","v":0},{"$f":"Miljö!H284","v":0},{"$f":"Miljö!I284","v":0},{"$f":"Miljö!J284","v":0},{"$f":"Miljö!K284","v":0},{"$f":"Miljö!L284","v":0}]
["Båt, gipsskivor","km",{"$f":"Miljö!C285","v":0},{"$f":"Miljö!D285","v":0},{"$f":"Miljö!E285","v":0},{"$f":"Miljö!F285","v":0},{"$f":"Miljö!G285","v":0},{"$f":"Miljö!H285","v":0},{"$f":"Miljö!I285","v":0},{"$f":"Miljö!J285","v":0},{"$f":"Miljö!K285","v":0},{"$f":"Miljö!L285","v":0}]
["Lastbil, takbeläggning","km",{"$f":"Miljö!C293","v":0},{"$f":"Miljö!D293","v":0},{"$f":"Miljö!E293","v":0},{"$f":"Miljö!F293","v":0},{"$f":"Miljö!G293","v":0},{"$f":"Miljö!H293","v":0},{"$f":"Miljö!I293","v":0},{"$f":"Miljö!J293","v":0},{"$f":"Miljö!K293","v":0},{"$f":"Miljö!L293","v":0}]
["Tåg, takbeläggning","km",{"$f":"Miljö!C294","v":0},{"$f":"Miljö!D294","v":0},{"$f":"Miljö!E294","v":0},{"$f":"Miljö!F294","v":0},{"$f":"Miljö!G294","v":0},{"$f":"Miljö!H294","v":0},{"$f":"Miljö!I294","v":0},{"$f":"Miljö!J294","v":0},{"$f":"Miljö!K294","v":0},{"$f":"Miljö!L294","v":0}]
["Båt, takbeläggning","km",{"$f":"Miljö!C295","v":0},{"$f":"Miljö!D295","v":0},{"$f":"Miljö!E295","v":0},{"$f":"Miljö!F295","v":0},{"$f":"Miljö!G295","v":0},{"$f":"Miljö!H295","v":0},{"$f":"Miljö!I295","v":0},{"$f":"Miljö!J295","v":0},{"$f":"Miljö!K295","v":0},{"$f":"Miljö!L295","v":0}]
["Lastbil, radiatorer","km",{"$f":"Miljö!C306","v":0},{"$f":"Miljö!D306","v":0},{"$f":"Miljö!E306","v":0},{"$f":"Miljö!F306","v":0},{"$f":"Miljö!G306","v":0},{"$f":"Miljö!H306","v":0},{"$f":"Miljö!I306","v":0},{"$f":"Miljö!J306","v":0},{"$f":"Miljö!K306","v":0},{"$f":"Miljö!L306","v":0}]
["Tåg, radiatorer","km",{"$f":"Miljö!C307","v":0},{"$f":"Miljö!D307","v":0},{"$f":"Miljö!E307","v":0},{"$f":"Miljö!F307","v":0},{"$f":"Miljö!G307","v":0},{"$f":"Miljö!H307","v":0},{"$f":"Miljö!I307","v":0},{"$f":"Miljö!J307","v":0},{"$f":"Miljö!K307","v":0},{"$f":"Miljö!L307","v":0}]
["Båt, radiatorer","km",{"$f":"Miljö!C308","v":0},{"$f":"Miljö!D308","v":0},{"$f":"Miljö!E308","v":0},{"$f":"Miljö!F308","v":0},{"$f":"Miljö!G308","v":0},{"$f":"Miljö!H308","v":0},{"$f":"Miljö!I308","v":0},{"$f":"Miljö!J308","v":0},{"$f":"Miljö!K308","v":0},{"$f":"Miljö!L308","v":0}]
["Lastbil, kopparrör","km",{"$f":"Miljö!C315","v":0},{"$f":"Miljö!D315","v":0},{"$f":"Miljö!E315","v":0},{"$f":"Miljö!F315","v":0},{"$f":"Miljö!G315","v":0},{"$f":"Miljö!H315","v":0},{"$f":"Miljö!I315","v":0},{"$f":"Miljö!J315","v":0},{"$f":"Miljö!K315","v":0},{"$f":"Miljö!L315","v":0}]
["Tåg, kopparrör","km",{"$f":"Miljö!C316","v":0},{"$f":"Miljö!D316","v":0},{"$f":"Miljö!E316","v":0},{"$f":"Miljö!F316","v":0},{"$f":"Miljö!G316","v":0},{"$f":"Miljö!H316","v":0},{"$f":"Miljö!I316","v":0},{"$f":"Miljö!J316","v":0},{"$f":"Miljö!K316","v":0},{"$f":"Miljö!L316","v":0}]
["Båt, kopparrör","km",{"$f":"Miljö!C317","v":0},{"$f":"Miljö!D317","v":0},{"$f":"Miljö!E317","v":0},{"$f":"Miljö!F317","v":0},{"$f":"Miljö!G317","v":0},{"$f":"Miljö!H317","v":0},{"$f":"Miljö!I317","v":0},{"$f":"Miljö!J317","v":0},{"$f":"Miljö!K317","v":0},{"$f":"Miljö!L317","v":0}]
["Lastbil, PEX-rör","km",{"$f":"Miljö!C324","v":0},{"$f":"Miljö!D324","v":0},{"$f":"Miljö!E324","v":0},{"$f":"Miljö!F324","v":0},{"$f":"Miljö!G324","v":0},{"$f":"Miljö!H324","v":0},{"$f":"Miljö!I324","v":0},{"$f":"Miljö!J324","v":0},{"$f":"Miljö!K324","v":0},{"$f":"Miljö!L324","v":0}]
["Tåg, PEX-rör","km",{"$f":"Miljö!C325","v":0},{"$f":"Miljö!D325","v":0},{"$f":"Miljö!E325","v":0},{"$f":"Miljö!F325","v":0},{"$f":"Miljö!G325","v":0},{"$f":"Miljö!H325","v":0},{"$f":"Miljö!I325","v":0},{"$f":"Miljö!J325","v":0},{"$f":"Miljö!K325","v":0},{"$f":"Miljö!L325","v":0}]
["Båt, PEX-rör","km",{"$f":"Miljö!C326","v":0},{"$f":"Miljö!D326","v":0},{"$f":"Miljö!E326","v":0},{"$f":"Miljö!F326","v":0},{"$f":"Miljö!G326","v":0},{"$f":"Miljö!H326","v":0},{"$f":"Miljö!I326","v":0},{"$f":"Miljö!J326","v":0},{"$f":"Miljö!K326","v":0},{"$f":"Miljö!L326","v":0}]
["Lastbil, pp-rör","km",{"$f":"Miljö!C333","v":0},{"$f":"Miljö!D333","v":0},{"$f":"Miljö!E333","v":0},{"$f":"Miljö!F333","v":0},{"$f":"Miljö!G333","v":0},{"$f":"Miljö!H333","v":0},{"$f":"Miljö!I333","v":0},{"$f":"Miljö!J333","v":0},{"$f":"Miljö!K333","v":0},{"$f":"Miljö!L333","v":0}]
["Tåg, pp-rör","km",{"$f":"Miljö!C334","v":0},{"$f":"Miljö!D334","v":0},{"$f":"Miljö!E334","v":0},{"$f":"Miljö!F334","v":0},{"$f":"Miljö!G334","v":0},{"$f":"Miljö!H334","v":0},{"$f":"Miljö!I334","v":0},{"$f":"Miljö!J334","v":0},{"$f":"Miljö!K334","v":0},{"$f":"Miljö!L334","v":0}]
["Båt, pp-rör","km",{"$f":"Miljö!C335","v":0},{"$f":"Miljö!D335","v":0},{"$f":"Miljö!E335","v":0},{"$f":"Miljö!F335","v":0},{"$f":"Miljö!G335","v":0},{"$f":"Miljö!H335","v":0},{"$f":"Miljö!I335","v":0},{"$f":"Miljö!J335","v":0},{"$f":"Miljö!K335","v":0},{"$f":"Miljö!L335","v":0}]
["Lastbil, järnrör","km",{"$f":"Miljö!C342","v":0},{"$f":"Miljö!D342","v":0},{"$f":"Miljö!E342","v":0},{"$f":"Miljö!F342","v":0},{"$f":"Miljö!G342","v":0},{"$f":"Miljö!H342","v":0},{"$f":"Miljö!I342","v":0},{"$f":"Miljö!J342","v":0},{"$f":"Miljö!K342","v":0},{"$f":"Miljö!L342","v":0}]
["Tåg, järnrör","km",{"$f":"Miljö!C343","v":0},{"$f":"Miljö!D343","v":0},{"$f":"Miljö!E343","v":0},{"$f":"Miljö!F343","v":0},{"$f":"Miljö!G343","v":0},{"$f":"Miljö!H343","v":0},{"$f":"Miljö!I343","v":0},{"$f":"Miljö!J343","v":0},{"$f":"Miljö!K343","v":0},{"$f":"Miljö!L343","v":0}]
["Båt, järnrör","km",{"$f":"Miljö!C344","v":0},{"$f":"Miljö!D344","v":0},{"$f":"Miljö!E344","v":0},{"$f":"Miljö!F344","v":0},{"$f":"Miljö!G344","v":0},{"$f":"Miljö!H344","v":0},{"$f":"Miljö!I344","v":0},{"$f":"Miljö!J344","v":0},{"$f":"Miljö!K344","v":0},{"$f":"Miljö!L344","v":0}]
["Lastbil, stålrör","km",{"$f":"Miljö!C351","v":0},{"$f":"Miljö!D351","v":0},{"$f":"Miljö!E351","v":0},{"$f":"Miljö!F351","v":0},{"$f":"Miljö!G351","v":0},{"$f":"Miljö!H351","v":0},{"$f":"Miljö!I351","v":0},{"$f":"Miljö!J351","v":0},{"$f":"Miljö!K351","v":0},{"$f":"Miljö!L351","v":0}]
["Tåg, stålrör","km",{"$f":"Miljö!C352","v":0},{"$f":"Miljö!D352","v":0},{"$f":"Miljö!E352","v":0},{"$f":"Miljö!F352","v":0},{"$f":"Miljö!G352","v":0},{"$f":"Miljö!H352","v":0},{"$f":"Miljö!I352","v":0},{"$f":"Miljö!J352","v":0},{"$f":"Miljö!K352","v":0},{"$f":"Miljö!L352","v":0}]
["Båt, stålrör","km",{"$f":"Miljö!C353","v":0},{"$f":"Miljö!D353","v":0},{"$f":"Miljö!E353","v":0},{"$f":"Miljö!F353","v":0},{"$f":"Miljö!G353","v":0},{"$f":"Miljö!H353","v":0},{"$f":"Miljö!I353","v":0},{"$f":"Miljö!J353","v":0},{"$f":"Miljö!K353","v":0},{"$f":"Miljö!L353","v":0}]
["Lastbil, relining","km",{"$f":"Miljö!C360","v":0},{"$f":"Miljö!D360","v":0},{"$f":"Miljö!E360","v":0},{"$f":"Miljö!F360","v":0},{"$f":"Miljö!G360","v":0},{"$f":"Miljö!H360","v":0},{"$f":"Miljö!I360","v":0},{"$f":"Miljö!J360","v":0},{"$f":"Miljö!K360","v":0},{"$f":"Miljö!L360","v":0}]
["Tåg, relining","km",{"$f":"Miljö!C361","v":0},{"$f":"Miljö!D361","v":0},{"$f":"Miljö!E361","v":0},{"$f":"Miljö!F361","v":0},{"$f":"Miljö!G361","v":0},{"$f":"Miljö!H361","v":0},{"$f":"Miljö!I361","v":0},{"$f":"Miljö!J361","v":0},{"$f":"Miljö!K361","v":0},{"$f":"Miljö!L361","v":0}]
["Båt, relining","km",{"$f":"Miljö!C362","v":0},{"$f":"Miljö!D362","v":0},{"$f":"Miljö!E362","v":0},{"$f":"Miljö!F362","v":0},{"$f":"Miljö!G362","v":0},{"$f":"Miljö!H362","v":0},{"$f":"Miljö!I362","v":0},{"$f":"Miljö!J362","v":0},{"$f":"Miljö!K362","v":0},{"$f":"Miljö!L362","v":0}]
["Lastbil, elledning","km",{"$f":"Miljö!C388","v":0},{"$f":"Miljö!D388","v":0},{"$f":"Miljö!E388","v":0},{"$f":"Miljö!F388","v":0},{"$f":"Miljö!G388","v":0},{"$f":"Miljö!H388","v":0},{"$f":"Miljö!I388","v":0},{"$f":"Miljö!J388","v":0},{"$f":"Miljö!K388","v":0},{"$f":"Miljö!L388","v":0}]
["Tåg, elledning","km",{"$f":"Miljö!C389","v":0},{"$f":"Miljö!D389","v":0},{"$f":"Miljö!E389","v":0},{"$f":"Miljö!F389","v":0},{"$f":"Miljö!G389","v":0},{"$f":"Miljö!H389","v":0},{"$f":"Miljö!I389","v":0},{"$f":"Miljö!J389","v":0},{"$f":"Miljö!K389","v":0},{"$f":"Miljö!L389","v":0}]
["Båt, elledning","km",{"$f":"Miljö!C390","v":0},{"$f":"Miljö!D390","v":0},{"$f":"Miljö!E390","v":0},{"$f":"Miljö!F390","v":0},{"$f":"Miljö!G390","v":0},{"$f":"Miljö!H390","v":0},{"$f":"Miljö!I390","v":0},{"$f":"Miljö!J390","v":0},{"$f":"Miljö!K390","v":0},{"$f":"Miljö!L390","v":0}]
[]
[]
[]
["Växthuseffekt"]
["Trp, isolering 1","kg CO2-eq/trp",{"$f":" C13/1000*(C44*$C$6+C45*$C$7+C46*$C$8)","v":0},0,0,0,0,0,0,0,0,0]
["Trp, isolering 2","kg CO2-eq/trp",{"$f":" C14/1000*(C47*$C$6+C48*$C$7+C49*$C$8)","v":0},0,0,0,0,0,0,0,0,0]
["Trp, fasad","kg CO2-eq/trp",{"$f":"C15/1000*(C50*$C$6+C51*$C$7+C52*$C$8)","v":0},0,0,0,0,0,0,0,0,0]
["Trp, fönster","kg CO2-eq/trp",{"$f":"C16/1000*(C53*$C$6+C54*$C$7+C55*$C$8)","v":0},0,0,0,0,0,0,0,0,0]
["Trp, dörrar","kg CO2-eq/trp",{"$f":"C17/1000*(C56*$C$6+C57*$C$7+C58*$C$8)","v":0},0,0,0,0,0,0,0,0,0]
["Trp, byte uppvärmning","kg CO2-eq/trp",{"$f":"C18/1000*(C59*$C$6+C60*$C$7+C61*$C$8)","v":0},0,0,0,0,0,0,0,0,0]
["Trp cirkpump","kg CO2-eq/trp",{"$f":"C19/1000*(C62*$C$6+C63*$C$7+C64*$C$8)","v":0},0,0,0,0,0,0,0,0,0]
["Trp vent kanaler","kg CO2-eq/trp",{"$f":"C20/1000*(C65*$C$6+C66*$C$7+C67*$C$8)","v":0},0,0,0,0,0,0,0,0,0]
["Trp luftflödesaggregat","kg CO2-eq/trp",{"$f":"C21/1000*(C68*$C$6+C69*$C$7+C70*$C$8)","v":0},0,0,0,0,0,0,0,0,0]
["Trp don och dämare","kg CO2-eq/trp",{"$f":"C22/1000*(C71*$C$6+C72*$C$7+C73*$C$8)","v":0},0,0,0,0,0,0,0,0,0]
["Trp total ventilation","kg CO2-eq/trp",{"$f":"SUM(C142:C144)","v":0},{"$f":"SUM(D142:D144)","v":0},0,0,0,0,0,0,0,0]
["Trp solel","kg CO2-eq/trp",{"$f":"C23/1000*SUMPRODUCT($C$6:$C$8,C74:C76)","v":0},{"$f":"D23/1000*SUMPRODUCT($C$6:$C$8,D74:D76)","v":0},0,0,0,0,0,0,0,0]
["Trä konstruktionsvirke","kg CO2-eq/trp",{"$f":"C24/1000*SUMPRODUCT($C$6:$C$8,C77:C79)","v":0},{"$f":"D24/1000*SUMPRODUCT($C$6:$C$8,D77:D79)","v":0},0,0,0,0,0,0,0,0]
["Trä målad träfasad","kg CO2-eq/trp",{"$f":"C25/1000*SUMPRODUCT($C$6:$C$8,C80:C82)","v":0},{"$f":"D25/1000*SUMPRODUCT($C$6:$C$8,D80:D82)","v":0},0,0,0,0,0,0,0,0]
["Trä invändig träpanel","kg CO2-eq/trp",{"$f":"C26/1000*SUMPRODUCT($C$6:$C$8,C83:C85)","v":0},{"$f":"D26/1000*SUMPRODUCT($C$6:$C$8,D83:D85)","v":0},0,0,0,0,0,0,0,0]
["Betong bjälklag","kg CO2-eq/trp",{"$f":"C27/1000*SUMPRODUCT($C$6:$C$8,C86:C88)","v":0},{"$f":"D27/1000*SUMPRODUCT($C$6:$C$8,D86:D88)","v":0},0,0,0,0,0,0,0,0]
["Betong bärande ytterväggar","kg CO2-eq/trp",{"$f":"C28/1000*SUMPRODUCT($C$6:$C$8,C89:C91)","v":0},{"$f":"D28/1000*SUMPRODUCT($C$6:$C$8,D89:D91)","v":0},0,0,0,0,0,0,0,0]
["Betong icke-bärande ytterväggar","kg CO2-eq/trp",{"$f":"C29/1000*SUMPRODUCT($C$6:$C$8,C92:C94)","v":0},{"$f":"D29/1000*SUMPRODUCT($C$6:$C$8,D92:D94)","v":0},0,0,0,0,0,0,0,0]
["Betong innerväggar","kg CO2-eq/trp",{"$f":"C30/1000*SUMPRODUCT($C$6:$C$8,C95:C97)","v":0},{"$f":"D30/1000*SUMPRODUCT($C$6:$C$8,D95:D97)","v":0},0,0,0,0,0,0,0,0]
["Puts","kg CO2-eq/trp",{"$f":"C31/1000*SUMPRODUCT($C$6:$C$8,C98:C100)","v":0},{"$f":"D31/1000*SUMPRODUCT($C$6:$C$8,D98:D100)","v":0},0,0,0,0,0,0,0,0]
["Gipsskivor","kg CO2-eq/trp",{"$f":"C32/1000*SUMPRODUCT($C$6:$C$8,C101:C103)","v":0},{"$f":"D32/1000*SUMPRODUCT($C$6:$C$8,D101:D103)","v":0},0,0,0,0,0,0,0,0]
["Takbeläggning","kg CO2-eq/trp",{"$f":"C33/1000*SUMPRODUCT($C$6:$C$8,C104:C106)","v":0},{"$f":"D33/1000*SUMPRODUCT($C$6:$C$8,D104:D106)","v":0},0,0,0,0,0,0,0,0]
["Trp radiatorer","kg CO2-eq/trp",{"$f":"C34/1000*(C107*$C$6+C108*$C$7+C109*$C$8)","v":0},0,0,0,0,0,0,0,0,0]
["Trp kopparrör","kg CO2-eq/trp",{"$f":"C35/1000*(C110*$C$6+C111*$C$7+C112*$C$8)","v":0},0,0,0,0,0,0,0,0,0]
["Trp PEX-rör","kg CO2-eq/trp",{"$f":"C36/1000*(C113*$C$6+C114*$C$7+C115*$C$8)","v":0},0,0,0,0,0,0,0,0,0]
["Trp pp-rör","kg CO2-eq/trp",{"$f":"C37/1000*(C116*$C$6+C117*$C$7+C118*$C$8)","v":0},0,0,0,0,0,0,0,0,0]
["Trp järnrör","kg CO2-eq/trp",{"$f":"C38/1000*(C119*$C$6+C120*$C$7+C121*$C$8)","v":0},0,0,0,0,0,0,0,0,0]
["Trp stålrör","kg CO2-eq/trp",{"$f":"C39/1000*(C122*$C$6+C123*$C$7+C124*$C$8)","v":0},0,0,0,0,0,0,0,0,0]
["Trp Total rör","kg CO2-eq/trp",{"$f":"SUM(C158:C162)","v":0},{"$f":"SUM(D158:D162)","v":0},0,0,0,0,0,0,0,0]
["Trp relining","kg CO2-eq/trp",{"$f":"C40/1000*(C125*$C$6+C126*$C$7+C127*$C$8)","v":0},0,0,0,0,0,0,0,0,0]
["Trp elledningar","kg CO2-eq/trp",{"$f":"C41/1000*(C128*$C$6+C129*$C$7+C130*$C$8)","v":0},{"$f":"D41/1000*(D128*$C$6+D129*$C$7+D130*$C$8)","v":0},0,0,0,0,0,0,0,0]
[]
["Primärenergi"]
["Trp, isolering 1","kWh/trp",{"$f":"C13/1000*(C44*$D$6+C45*$D$7+C46*$D$8)","v":0},0,0,0,0,0,0,0,0,0]
["Trp, isolering 2","kWh/trp",{"$f":"C14/1000*(C47*$D$6+C48*$D$7+C49*$D$8)","v":0},0,0,0,0,0,0,0,0,0]
["Trp, fasad","kWh/trp",{"$f":"C15/1000*(C50*$D$6+C51*$D$7+C52*$D$8)","v":0},0,0,0,0,0,0,0,0,0]
["Trp, fönster","kWh/trp",{"$f":"C16/1000*(C53*$D$6+C54*$D$7+C55*$D$8)","v":0},0,0,0,0,0,0,0,0,0]
["Trp, dörrar",null,{"$f":"C17/1000*(C56*$D$6+C57*$D$7+C58*$D$8)","v":0},0,0,0,0,0,0,0,0,0]
["Trp, byte uppvärmning","kWh/trp",{"$f":"C18/1000*(C59*$D$6+C60*$D$7+C61*$D$8)","v":0},0,0,0,0,0,0,0,0,0]
["Trp cirkpump","kWh/trp",{"$f":"C19/1000*(C62*$D$6+C63*$D$7+C64*$D$8)","v":0},0,0,0,0,0,0,0,0,0]
["Trp vent kanaler","kWh/trp",{"$f":"C20/1000*(C65*$D$6+C66*$D$7+C67*$D$8)","v":0},0,0,0,0,0,0,0,0,0]
["Trp luftflödesaggregat","kWh/trp",{"$f":"C21/1000*(C68*$D$6+C69*$D$7+C70*$D$8)","v":0},0,0,0,0,0,0,0,0,0]
["Trp don och dämare","kWh/trp",{"$f":"C22/1000*(C71*$D$6+C72*$D$7+C73*$D$8)","v":0},0,0,0,0,0,0,0,0,0]
["Trp total ventilation","kWh/trp",{"$f":"SUM(C175:C177)","v":0},0,0,0,0,0,0,0,0,0]
["Trp solel","kWh/trp",{"$f":"C23/1000*SUMPRODUCT($D$6:$D$8,C74:C76)","v":0},{"$f":"D23/1000*SUMPRODUCT($D$6:$D$8,D76:D78)","v":0},0,0,0,0,0,0,0,0]
["Trä konstruktionsvirke","kWh/trp",{"$f":"C24/1000*SUMPRODUCT($D$6:$D$8,C77:C79)","v":0},0,0,0,0,0,0,0,0,0]
["Trä målad träfasad","kWh/trp",{"$f":"C25/1000*SUMPRODUCT($D$6:$D$8,C80:C82)","v":0},{"$f":"D25/1000*SUMPRODUCT($D$6:$D$8,D80:D82)","v":0},0,0,0,0,0,0,0,0]
["Trä invändig träpanel","kWh/trp",{"$f":"C26/1000*SUMPRODUCT($D$6:$D$8,C83:C85)","v":0},{"$f":"D26/1000*SUMPRODUCT($D$6:$D$8,D83:D85)","v":0},0,0,0,0,0,0,0,0]
["Betong bjälklag","kWh/trp",{"$f":"C27/1000*SUMPRODUCT($D$6:$D$8,C86:C88)","v":0},{"$f":"D27/1000*SUMPRODUCT($D$6:$D$8,D86:D88)","v":0},0,0,0,0,0,0,0,0]
["Betong bärande ytterväggar","kWh/trp",{"$f":"C28/1000*SUMPRODUCT($D$6:$D$8,C89:C91)","v":0},{"$f":"D28/1000*SUMPRODUCT($D$6:$D$8,D89:D91)","v":0},0,0,0,0,0,0,0,0]
["Betong icke-bärande ytterväggar","kWh/trp",{"$f":"C29/1000*SUMPRODUCT($D$6:$D$8,C92:C94)","v":0},{"$f":"D29/1000*SUMPRODUCT($D$6:$D$8,D92:D94)","v":0},0,0,0,0,0,0,0,0]
["Betong innerväggar","kWh/trp",{"$f":"C30/1000*SUMPRODUCT($D$6:$D$8,C95:C97)","v":0},{"$f":"D30/1000*SUMPRODUCT($D$6:$D$8,D95:D97)","v":0},0,0,0,0,0,0,0,0]
["Puts","kWh/trp",{"$f":"C31/1000*SUMPRODUCT($D$6:$D$8,C98:C100)","v":0},{"$f":"D31/1000*SUMPRODUCT($D$6:$D$8,D98:D100)","v":0},0,0,0,0,0,0,0,0]
["Gipsskivor","kWh/trp",{"$f":"C32/1000*SUMPRODUCT($D$6:$D$8,C101:C103)","v":0},{"$f":"D32/1000*SUMPRODUCT($D$6:$D$8,D101:D103)","v":0},0,0,0,0,0,0,0,0]
["Takbeläggning","kWh/trp",{"$f":"C33/1000*SUMPRODUCT($D$6:$D$8,C104:C106)","v":0},{"$f":"D33/1000*SUMPRODUCT($D$6:$D$8,D104:D106)","v":0},0,0,0,0,0,0,0,0]
["Trp, radiatorer","kWh/trp",{"$f":"C34/1000*(C107*$D$6+C108*$D$7+C109*$D$8)","v":0},0,0,0,0,0,0,0,0,0]
["Trp kopparrör","kWh/trp",{"$f":"C35/1000*(C110*$D$6+C111*$D$7+C112*$D$8)","v":0},0,0,0,0,0,0,0,0,0]
["Trp PEX-rör","kWh/trp",{"$f":"C36/1000*(C113*$D$6+C114*$D$7+C115*$D$8)","v":0},0,0,0,0,0,0,0,0,0]
["Trp pp-rör","kWh/trp",{"$f":"C37/1000*(C116*$D$6+C117*$D$7+C118*$D$8)","v":0},0,0,0,0,0,0,0,0,0]
["Trp järnrör","kWh/trp",{"$f":"C38/1000*(C119*$D$6+C120*$D$7+C121*$D$8)","v":0},0,0,0,0,0,0,0,0,0]
["Trp stålrör","kWh/trp",{"$f":"C39/1000*(C122*$D$6+C123*$D$7+C124*$D$8)","v":0},0,0,0,0,0,0,0,0,0]
["Trp Total rör","kWh/trp",{"$f":"SUM(C191:C195)","v":0},{"$f":"SUM(D191:D195)","v":0},0,{"$f":"SUM(F191:F195)","v":0},0,{"$f":"SUM(H191:H195)","v":0},0,0,0,0]
["Trp relining","kWh/trp",{"$f":"C40/1000*(C125*$D$6+C126*$D$7+C127*$D$8)","v":0},0,0,0,0,0,0,0,0,0]
["Trp elledningar","kWh/trp",{"$f":"C41/1000*(C128*$D$6+C129*$D$7+C130*$D$8)","v":0},0,0,0,0,0,0,0,0,0]

{"sheet":"Calc","index":7,"n_rows":246,"n_cols":13,"rows_kept":246,"cut":false,"hidden":true,"merged":[]}
[]
["7. Beräkning av ändring i miljöpåverkan"]
[]
["7.1 Antal investeringar under vald tidsperiod "]
["Isolering 1","st",{"$f":"IF(Miljö!C151=TRUE,Miljö!$C$16/Miljö!C152,0)","v":0},{"$f":"IF(Miljö!D151=TRUE,Miljö!$C$16/Miljö!D152,0)","v":0},{"$f":"IF(Miljö!E151=TRUE,Miljö!$C$16/Miljö!E152,0)","v":0},{"$f":"IF(Miljö!F151=TRUE,Miljö!$C$16/Miljö!F152,0)","v":0},{"$f":"IF(Miljö!G151=TRUE,Miljö!$C$16/Miljö!G152,0)","v":0},{"$f":"IF(Miljö!H151=TRUE,Miljö!$C$16/Miljö!H152,0)","v":0},{"$f":"IF(Miljö!I151=TRUE,Miljö!$C$16/Miljö!I152,0)","v":0},{"$f":"IF(Miljö!J151=TRUE,Miljö!$C$16/Miljö!J152,0)","v":0},{"$f":"IF(Miljö!K151=TRUE,Miljö!$C$16/Miljö!K152,0)","v":0},{"$f":"IF(Miljö!L151=TRUE,Miljö!$C$16/Miljö!L152,0)","v":0},"Antalet återinvesteringar som behövs under den valda tidsperioden"]
["Isolering 2","st",{"$f":"IF(Miljö!C161=TRUE,Miljö!$C$16/Miljö!C162,0)","v":0},{"$f":"IF(Miljö!D161=TRUE,Miljö!$C$16/Miljö!D162,0)","v":0},{"$f":"IF(Miljö!E161=TRUE,Miljö!$C$16/Miljö!E162,0)","v":0},{"$f":"IF(Miljö!F161=TRUE,Miljö!$C$16/Miljö!F162,0)","v":0},{"$f":"IF(Miljö!G161=TRUE,Miljö!$C$16/Miljö!G162,0)","v":0},{"$f":"IF(Miljö!H161=TRUE,Miljö!$C$16/Miljö!H162,0)","v":0},{"$f":"IF(Miljö!I161=TRUE,Miljö!$C$16/Miljö!I162,0)","v":0},{"$f":"IF(Miljö!J161=TRUE,Miljö!$C$16/Miljö!J162,0)","v":0},{"$f":"IF(Miljö!K161=TRUE,Miljö!$C$16/Miljö!K162,0)","v":0},{"$f":"IF(Miljö!L161=TRUE,Miljö!$C$16/Miljö!L162,0)","v":0},"Antag att samma förutsättningar gäller även vid framtida nyinvesteringar"]
["Fasadsystem","st",{"$f":"IF(Miljö!C171=TRUE,Miljö!$C$16/Miljö!C172,0)","v":0},{"$f":"IF(Miljö!D171=TRUE,Miljö!$C$16/Miljö!D172,0)","v":0},{"$f":"IF(Miljö!E171=TRUE,Miljö!$C$16/Miljö!E172,0)","v":0},{"$f":"IF(Miljö!F171=TRUE,Miljö!$C$16/Miljö!F172,0)","v":0},{"$f":"IF(Miljö!G171=TRUE,Miljö!$C$16/Miljö!G172,0)","v":0},{"$f":"IF(Miljö!H171=TRUE,Miljö!$C$16/Miljö!H172,0)","v":0},{"$f":"IF(Miljö!I171=TRUE,Miljö!$C$16/Miljö!I172,0)","v":0},{"$f":"IF(Miljö!J171=TRUE,Miljö!$C$16/Miljö!J172,0)","v":0},{"$f":"IF(Miljö!K171=TRUE,Miljö!$C$16/Miljö!K172,0)","v":0},{"$f":"IF(Miljö!L171=TRUE,Miljö!$C$16/Miljö!L172,0)","v":0},"Räkna inte in hela påverkan från sista bytet om det finns \"restvärde\" (Tidigare avrundades uppåt)"]
["Fönster","st",{"$f":"IF(Miljö!C181=TRUE,Miljö!$C$16/Miljö!C182,0)","v":0},{"$f":"IF(Miljö!D181=TRUE,Miljö!$C$16/Miljö!D182,0)","v":0},{"$f":"IF(Miljö!E181=TRUE,Miljö!$C$16/Miljö!E182,0)","v":0},{"$f":"IF(Miljö!F181=TRUE,Miljö!$C$16/Miljö!F182,0)","v":0},{"$f":"IF(Miljö!G181=TRUE,Miljö!$C$16/Miljö!G182,0)","v":0},{"$f":"IF(Miljö!H181=TRUE,Miljö!$C$16/Miljö!H182,0)","v":0},{"$f":"IF(Miljö!I181=TRUE,Miljö!$C$16/Miljö!I182,0)","v":0},{"$f":"IF(Miljö!J181=TRUE,Miljö!$C$16/Miljö!J182,0)","v":0},{"$f":"IF(Miljö!K181=TRUE,Miljö!$C$16/Miljö!K182,0)","v":0},{"$f":"IF(Miljö!L181=TRUE,Miljö!$C$16/Miljö!L182,0)","v":0}]
["Dörrar","st",{"$f":"IF(Miljö!C191=TRUE,Miljö!$C$16/Miljö!C192,0)","v":0},{"$f":"IF(Miljö!D191=TRUE,Miljö!$C$16/Miljö!D192,0)","v":0},{"$f":"IF(Miljö!E191=TRUE,Miljö!$C$16/Miljö!E192,0)","v":0},{"$f":"IF(Miljö!F191=TRUE,Miljö!$C$16/Miljö!F192,0)","v":0},{"$f":"IF(Miljö!G191=TRUE,Miljö!$C$16/Miljö!G192,0)","v":0},{"$f":"IF(Miljö!H191=TRUE,Miljö!$C$16/Miljö!H192,0)","v":0},{"$f":"IF(Miljö!I191=TRUE,Miljö!$C$16/Miljö!I192,0)","v":0},{"$f":"IF(Miljö!J191=TRUE,Miljö!$C$16/Miljö!J192,0)","v":0},{"$f":"IF(Miljö!K191=TRUE,Miljö!$C$16/Miljö!K192,0)","v":0},{"$f":"IF(Miljö!L191=TRUE,Miljö!$C$16/Miljö!L192,0)","v":0}]
["Byte uppvärmningsform ","st",{"$f":"IF(Miljö!C98=TRUE,Miljö!$C$16/Miljö!C99,0)","v":0},{"$f":"IF(Miljö!D98=TRUE,Miljö!$C$16/Miljö!D99,0)","v":0},{"$f":"IF(Miljö!E98=TRUE,Miljö!$C$16/Miljö!E99,0)","v":0},{"$f":"IF(Miljö!F98=TRUE,Miljö!$C$16/Miljö!F99,0)","v":0},{"$f":"IF(Miljö!G98=TRUE,Miljö!$C$16/Miljö!G99,0)","v":0},{"$f":"IF(Miljö!H98=TRUE,Miljö!$C$16/Miljö!H99,0)","v":0},{"$f":"IF(Miljö!I98=TRUE,Miljö!$C$16/Miljö!I99,0)","v":0},{"$f":"IF(Miljö!J98=TRUE,Miljö!$C$16/Miljö!J99,0)","v":0},{"$f":"IF(Miljö!K98=TRUE,Miljö!$C$16/Miljö!K99,0)","v":0},{"$f":"IF(Miljö!L98=TRUE,Miljö!$C$16/Miljö!L99,0)","v":0}]
["Byte uppvärmningsform (kringmaterial borrhål, anslutning fjv etc.)","st",{"$f":"IF(Miljö!C98=TRUE,IF(Miljö!C94=1, Miljö!$C$16/Uppvärmning!$F$6,IF(Miljö!C94=3,Miljö!$C$16/Uppvärmning!$F$8,IF(Miljö!C94=4,Miljö!$C$16/Uppvärmning!$F$9, IF(Miljö!C94=5,Miljö!$C$16/Uppvärmning!$F$10, 0)))),0)","v":0},{"$f":"IF(Miljö!D98=TRUE,IF(Miljö!D94=1, Miljö!$C$16/Uppvärmning!$F$6,IF(Miljö!D94=3,Miljö!$C$16/Uppvärmning!$F$8,IF(Miljö!D94=4,Miljö!$C$16/Uppvärmning!$F$9, IF(Miljö!D94=5,Miljö!$C$16/Uppvärmning!$F$10, 0)))),0)","v":0},{"$f":"IF(Miljö!E98=TRUE,IF(Miljö!E94=1, Miljö!$C$16/Uppvärmning!$F$6,IF(Miljö!E94=3,Miljö!$C$16/Uppvärmning!$F$8,IF(Miljö!E94=4,Miljö!$C$16/Uppvärmning!$F$9, IF(Miljö!E94=5,Miljö!$C$16/Uppvärmning!$F$10, 0)))),0)","v":0},{"$f":"IF(Miljö!F98=TRUE,IF(Miljö!F94=1, Miljö!$C$16/Uppvärmning!$F$6,IF(Miljö!F94=3,Miljö!$C$16/Uppvärmning!$F$8,IF(Miljö!F94=4,Miljö!$C$16/Uppvärmning!$F$9, IF(Miljö!F94=5,Miljö!$C$16/Uppvärmning!$F$10, 0)))),0)","v":0},{"$f":"IF(Miljö!G98=TRUE,IF(Miljö!G94=1, Miljö!$C$16/Uppvärmning!$F$6,IF(Miljö!G94=3,Miljö!$C$16/Uppvärmning!$F$8,IF(Miljö!G94=4,Miljö!$C$16/Uppvärmning!$F$9, IF(Miljö!G94=5,Miljö!$C$16/Uppvärmning!$F$10, 0)))),0)","v":0},{"$f":"IF(Miljö!H98=TRUE,IF(Miljö!H94=1, Miljö!$C$16/Uppvärmning!$F$6,IF(Miljö!H94=3,Miljö!$C$16/Uppvärmning!$F$8,IF(Miljö!H94=4,Miljö!$C$16/Uppvärmning!$F$9, IF(Miljö!H94=5,Miljö!$C$16/Uppvärmning!$F$10, 0)))),0)","v":0},{"$f":"IF(Miljö!I98=TRUE,IF(Miljö!I94=1, Miljö!$C$16/Uppvärmning!$F$6,IF(Miljö!I94=3,Miljö!$C$16/Uppvärmning!$F$8,IF(Miljö!I94=4,Miljö!$C$16/Uppvärmning!$F$9, IF(Miljö!I94=5,Miljö!$C$16/Uppvärmning!$F$10, 0)))),0)","v":0},{"$f":"IF(Miljö!J98=TRUE,IF(Miljö!J94=1, Miljö!$C$16/Uppvärmning!$F$6,IF(Miljö!J94=3,Miljö!$C$16/Uppvärmning!$F$8,IF(Miljö!J94=4,Miljö!$C$16/Uppvärmning!$F$9, IF(Miljö!J94=5,Miljö!$C$16/Uppvärmning!$F$10, 0)))),0)","v":0},{"$f":"IF(Miljö!K98=TRUE,IF(Miljö!K94=1, Miljö!$C$16/Uppvärmning!$F$6,IF(Miljö!K94=3,Miljö!$C$16/Uppvärmning!$F$8,IF(Miljö!K94=4,Miljö!$C$16/Uppvärmning!$F$9, IF(Miljö!K94=5,Miljö!$C$16/Uppvärmning!$F$10, 0)))),0)","v":0},{"$f":"IF(Miljö!L98=TRUE,IF(Miljö!L94=1, Miljö!$C$16/Uppvärmning!$F$6,IF(Miljö!L94=3,Miljö!$C$16/Uppvärmning!$F$8,IF(Miljö!L94=4,Miljö!$C$16/Uppvärmning!$F$9, IF(Miljö!L94=5,Miljö!$C$16/Uppvärmning!$F$10, 0)))),0)","v":0}]
["Cirkulationspump","st",{"$f":"IF(Miljö!C111=TRUE,Miljö!$C$16/Miljö!C112,0)","v":0},{"$f":"IF(Miljö!D111=TRUE,Miljö!$C$16/Miljö!D112,0)","v":0},{"$f":"IF(Miljö!E111=TRUE,Miljö!$C$16/Miljö!E112,0)","v":0},{"$f":"IF(Miljö!F111=TRUE,Miljö!$C$16/Miljö!F112,0)","v":0},{"$f":"IF(Miljö!G111=TRUE,Miljö!$C$16/Miljö!G112,0)","v":0},{"$f":"IF(Miljö!H111=TRUE,Miljö!$C$16/Miljö!H112,0)","v":0},{"$f":"IF(Miljö!I111=TRUE,Miljö!$C$16/Miljö!I112,0)","v":0},{"$f":"IF(Miljö!J111=TRUE,Miljö!$C$16/Miljö!J112,0)","v":0},{"$f":"IF(Miljö!K111=TRUE,Miljö!$C$16/Miljö!K112,0)","v":0},{"$f":"IF(Miljö!L111=TRUE,Miljö!$C$16/Miljö!L112,0)","v":0}]
["Ventilationskanaler","st",{"$f":"IF(Miljö!C365=TRUE,Miljö!$C$16/Miljö!C366,0)","v":0},{"$f":"IF(Miljö!D365=TRUE,Miljö!$C$16/Miljö!D366,0)","v":0},{"$f":"IF(Miljö!E365=TRUE,Miljö!$C$16/Miljö!E366,0)","v":0},{"$f":"IF(Miljö!F365=TRUE,Miljö!$C$16/Miljö!F366,0)","v":0},{"$f":"IF(Miljö!G365=TRUE,Miljö!$C$16/Miljö!G366,0)","v":0},{"$f":"IF(Miljö!H365=TRUE,Miljö!$C$16/Miljö!H366,0)","v":0},{"$f":"IF(Miljö!I365=TRUE,Miljö!$C$16/Miljö!I366,0)","v":0},{"$f":"IF(Miljö!J365=TRUE,Miljö!$C$16/Miljö!J366,0)","v":0},{"$f":"IF(Miljö!K365=TRUE,Miljö!$C$16/Miljö!K366,0)","v":0},{"$f":"IF(Miljö!L365=TRUE,Miljö!$C$16/Miljö!L366,0)","v":0}]
["Luftflödesaggregat","st",{"$f":"IF(Miljö!C120=TRUE,Miljö!$C$16/Miljö!C121,0)","v":0},{"$f":"IF(Miljö!D120=TRUE,Miljö!$C$16/Miljö!D121,0)","v":0},{"$f":"IF(Miljö!E120=TRUE,Miljö!$C$16/Miljö!E121,0)","v":0},{"$f":"IF(Miljö!F120=TRUE,Miljö!$C$16/Miljö!F121,0)","v":0},{"$f":"IF(Miljö!G120=TRUE,Miljö!$C$16/Miljö!G121,0)","v":0},{"$f":"IF(Miljö!H120=TRUE,Miljö!$C$16/Miljö!H121,0)","v":0},{"$f":"IF(Miljö!I120=TRUE,Miljö!$C$16/Miljö!I121,0)","v":0},{"$f":"IF(Miljö!J120=TRUE,Miljö!$C$16/Miljö!J121,0)","v":0},{"$f":"IF(Miljö!K120=TRUE,Miljö!$C$16/Miljö!K121,0)","v":0},{"$f":"IF(Miljö!L120=TRUE,Miljö!$C$16/Miljö!L121,0)","v":0}]
["Don och dämpare för ventilation","st",{"$f":"IF(Miljö!C375=TRUE,Miljö!$C$16/Miljö!C376,0)","v":0},{"$f":"IF(Miljö!D375=TRUE,Miljö!$C$16/Miljö!D376,0)","v":0},{"$f":"IF(Miljö!E375=TRUE,Miljö!$C$16/Miljö!E376,0)","v":0},{"$f":"IF(Miljö!F375=TRUE,Miljö!$C$16/Miljö!F376,0)","v":0},{"$f":"IF(Miljö!G375=TRUE,Miljö!$C$16/Miljö!G376,0)","v":0},{"$f":"IF(Miljö!H375=TRUE,Miljö!$C$16/Miljö!H376,0)","v":0},{"$f":"IF(Miljö!I375=TRUE,Miljö!$C$16/Miljö!I376,0)","v":0},{"$f":"IF(Miljö!J375=TRUE,Miljö!$C$16/Miljö!J376,0)","v":0},{"$f":"IF(Miljö!K375=TRUE,Miljö!$C$16/Miljö!K376,0)","v":0},{"$f":"IF(Miljö!L375=TRUE,Miljö!$C$16/Miljö!L376,0)","v":0}]
["Trä konstruktionsvirke","st",{"$f":"IF(Miljö!C204=TRUE,Miljö!$C$16/Miljö!C205,0)","v":0},{"$f":"IF(Miljö!D204=TRUE,Miljö!$C$16/Miljö!D205,0)","v":0},{"$f":"IF(Miljö!E204=TRUE,Miljö!$C$16/Miljö!E205,0)","v":0},{"$f":"IF(Miljö!F204=TRUE,Miljö!$C$16/Miljö!F205,0)","v":0},{"$f":"IF(Miljö!G204=TRUE,Miljö!$C$16/Miljö!G205,0)","v":0},{"$f":"IF(Miljö!H204=TRUE,Miljö!$C$16/Miljö!H205,0)","v":0},{"$f":"IF(Miljö!I204=TRUE,Miljö!$C$16/Miljö!I205,0)","v":0},{"$f":"IF(Miljö!J204=TRUE,Miljö!$C$16/Miljö!J205,0)","v":0},{"$f":"IF(Miljö!K204=TRUE,Miljö!$C$16/Miljö!K205,0)","v":0},{"$f":"IF(Miljö!L204=TRUE,Miljö!$C$16/Miljö!L205,0)","v":0}]
["Trä målad träfasad","st",{"$f":"IF(Miljö!C213=TRUE,Miljö!$C$16/Miljö!C214,0)","v":0},{"$f":"IF(Miljö!D213=TRUE,Miljö!$C$16/Miljö!D214,0)","v":0},{"$f":"IF(Miljö!E213=TRUE,Miljö!$C$16/Miljö!E214,0)","v":0},{"$f":"IF(Miljö!F213=TRUE,Miljö!$C$16/Miljö!F214,0)","v":0},{"$f":"IF(Miljö!G213=TRUE,Miljö!$C$16/Miljö!G214,0)","v":0},{"$f":"IF(Miljö!H213=TRUE,Miljö!$C$16/Miljö!H214,0)","v":0},{"$f":"IF(Miljö!I213=TRUE,Miljö!$C$16/Miljö!I214,0)","v":0},{"$f":"IF(Miljö!J213=TRUE,Miljö!$C$16/Miljö!J214,0)","v":0},{"$f":"IF(Miljö!K213=TRUE,Miljö!$C$16/Miljö!K214,0)","v":0},{"$f":"IF(Miljö!L213=TRUE,Miljö!$C$16/Miljö!L214,0)","v":0}]
["Trä invändig träpanel","st",{"$f":"IF(Miljö!C222=TRUE,Miljö!$C$16/Miljö!C223,0)","v":0},{"$f":"IF(Miljö!D222=TRUE,Miljö!$C$16/Miljö!D223,0)","v":0},{"$f":"IF(Miljö!E222=TRUE,Miljö!$C$16/Miljö!E223,0)","v":0},{"$f":"IF(Miljö!F222=TRUE,Miljö!$C$16/Miljö!F223,0)","v":0},{"$f":"IF(Miljö!G222=TRUE,Miljö!$C$16/Miljö!G223,0)","v":0},{"$f":"IF(Miljö!H222=TRUE,Miljö!$C$16/Miljö!H223,0)","v":0},{"$f":"IF(Miljö!I222=TRUE,Miljö!$C$16/Miljö!I223,0)","v":0},{"$f":"IF(Miljö!J222=TRUE,Miljö!$C$16/Miljö!J223,0)","v":0},{"$f":"IF(Miljö!K222=TRUE,Miljö!$C$16/Miljö!K223,0)","v":0},{"$f":"IF(Miljö!L222=TRUE,Miljö!$C$16/Miljö!L223,0)","v":0}]
["Betong bjälklag","st",{"$f":"IF(Miljö!C231=TRUE,Miljö!$C$16/Miljö!C232,0)","v":0},{"$f":"IF(Miljö!D231=TRUE,Miljö!$C$16/Miljö!D232,0)","v":0},{"$f":"IF(Miljö!E231=TRUE,Miljö!$C$16/Miljö!E232,0)","v":0},{"$f":"IF(Miljö!F231=TRUE,Miljö!$C$16/Miljö!F232,0)","v":0},{"$f":"IF(Miljö!G231=TRUE,Miljö!$C$16/Miljö!G232,0)","v":0},{"$f":"IF(Miljö!H231=TRUE,Miljö!$C$16/Miljö!H232,0)","v":0},{"$f":"IF(Miljö!I231=TRUE,Miljö!$C$16/Miljö!I232,0)","v":0},{"$f":"IF(Miljö!J231=TRUE,Miljö!$C$16/Miljö!J232,0)","v":0},{"$f":"IF(Miljö!K231=TRUE,Miljö!$C$16/Miljö!K232,0)","v":0},{"$f":"IF(Miljö!L231=TRUE,Miljö!$C$16/Miljö!L232,0)","v":0}]
["Betong bärande ytterväggar","st",{"$f":"IF(Miljö!C241=TRUE,Miljö!$C$16/Miljö!C242,0)","v":0},{"$f":"IF(Miljö!D241=TRUE,Miljö!$C$16/Miljö!D242,0)","v":0},{"$f":"IF(Miljö!E241=TRUE,Miljö!$C$16/Miljö!E242,0)","v":0},{"$f":"IF(Miljö!F241=TRUE,Miljö!$C$16/Miljö!F242,0)","v":0},{"$f":"IF(Miljö!G241=TRUE,Miljö!$C$16/Miljö!G242,0)","v":0},{"$f":"IF(Miljö!H241=TRUE,Miljö!$C$16/Miljö!H242,0)","v":0},{"$f":"IF(Miljö!I241=TRUE,Miljö!$C$16/Miljö!I242,0)","v":0},{"$f":"IF(Miljö!J241=TRUE,Miljö!$C$16/Miljö!J242,0)","v":0},{"$f":"IF(Miljö!K241=TRUE,Miljö!$C$16/Miljö!K242,0)","v":0},{"$f":"IF(Miljö!L241=TRUE,Miljö!$C$16/Miljö!L242,0)","v":0}]
["Betong icke-bärande ytterväggar","st",{"$f":"IF(Miljö!C251=TRUE,Miljö!$C$16/Miljö!C252,0)","v":0},{"$f":"IF(Miljö!D251=TRUE,Miljö!$C$16/Miljö!D252,0)","v":0},{"$f":"IF(Miljö!E251=TRUE,Miljö!$C$16/Miljö!E252,0)","v":0},{"$f":"IF(Miljö!F251=TRUE,Miljö!$C$16/Miljö!F252,0)","v":0},{"$f":"IF(Miljö!G251=TRUE,Miljö!$C$16/Miljö!G252,0)","v":0},{"$f":"IF(Miljö!H251=TRUE,Miljö!$C$16/Miljö!H252,0)","v":0},{"$f":"IF(Miljö!I251=TRUE,Miljö!$C$16/Miljö!I252,0)","v":0},{"$f":"IF(Miljö!J251=TRUE,Miljö!$C$16/Miljö!J252,0)","v":0},{"$f":"IF(Miljö!K251=TRUE,Miljö!$C$16/Miljö!K252,0)","v":0},{"$f":"IF(Miljö!L251=TRUE,Miljö!$C$16/Miljö!L252,0)","v":0}]
["Betong innerväggar","st",{"$f":"IF(Miljö!C260=TRUE,Miljö!$C$16/Miljö!C261,0)","v":0},{"$f":"IF(Miljö!D260=TRUE,Miljö!$C$16/Miljö!D261,0)","v":0},{"$f":"IF(Miljö!E260=TRUE,Miljö!$C$16/Miljö!E261,0)","v":0},{"$f":"IF(Miljö!F260=TRUE,Miljö!$C$16/Miljö!F261,0)","v":0},{"$f":"IF(Miljö!G260=TRUE,Miljö!$C$16/Miljö!G261,0)","v":0},{"$f":"IF(Miljö!H260=TRUE,Miljö!$C$16/Miljö!H261,0)","v":0},{"$f":"IF(Miljö!I260=TRUE,Miljö!$C$16/Miljö!I261,0)","v":0},{"$f":"IF(Miljö!J260=TRUE,Miljö!$C$16/Miljö!J261,0)","v":0},{"$f":"IF(Miljö!K260=TRUE,Miljö!$C$16/Miljö!K261,0)","v":0},{"$f":"IF(Miljö!L260=TRUE,Miljö!$C$16/Miljö!L261,0)","v":0}]
["Puts","st",{"$f":"IF(Miljö!C270=TRUE,Miljö!$C$16/Miljö!C271,0)","v":0},{"$f":"IF(Miljö!D270=TRUE,Miljö!$C$16/Miljö!D271,0)","v":0},{"$f":"IF(Miljö!E270=TRUE,Miljö!$C$16/Miljö!E271,0)","v":0},{"$f":"IF(Miljö!F270=TRUE,Miljö!$C$16/Miljö!F271,0)","v":0},{"$f":"IF(Miljö!G270=TRUE,Miljö!$C$16/Miljö!G271,0)","v":0},{"$f":"IF(Miljö!H270=TRUE,Miljö!$C$16/Miljö!H271,0)","v":0},{"$f":"IF(Miljö!I270=TRUE,Miljö!$C$16/Miljö!I271,0)","v":0},{"$f":"IF(Miljö!J270=TRUE,Miljö!$C$16/Miljö!J271,0)","v":0},{"$f":"IF(Miljö!K270=TRUE,Miljö!$C$16/Miljö!K271,0)","v":0},{"$f":"IF(Miljö!L270=TRUE,Miljö!$C$16/Miljö!L271,0)","v":0}]
["Gipsskivor","st",{"$f":"IF(Miljö!C279=TRUE,Miljö!$C$16/Miljö!C280,0)","v":0},{"$f":"IF(Miljö!D279=TRUE,Miljö!$C$16/Miljö!D280,0)","v":0},{"$f":"IF(Miljö!E279=TRUE,Miljö!$C$16/Miljö!E280,0)","v":0},{"$f":"IF(Miljö!F279=TRUE,Miljö!$C$16/Miljö!F280,0)","v":0},{"$f":"IF(Miljö!G279=TRUE,Miljö!$C$16/Miljö!G280,0)","v":0},{"$f":"IF(Miljö!H279=TRUE,Miljö!$C$16/Miljö!H280,0)","v":0},{"$f":"IF(Miljö!I279=TRUE,Miljö!$C$16/Miljö!I280,0)","v":0},{"$f":"IF(Miljö!J279=TRUE,Miljö!$C$16/Miljö!J280,0)","v":0},{"$f":"IF(Miljö!K279=TRUE,Miljö!$C$16/Miljö!K280,0)","v":0},{"$f":"IF(Miljö!L279=TRUE,Miljö!$C$16/Miljö!L280,0)","v":0}]
["Takbeläggning","st",{"$f":"IF(Miljö!C288=TRUE,Miljö!$C$16/Miljö!C289,0)","v":0},{"$f":"IF(Miljö!D288=TRUE,Miljö!$C$16/Miljö!D289,0)","v":0},{"$f":"IF(Miljö!E288=TRUE,Miljö!$C$16/Miljö!E289,0)","v":0},{"$f":"IF(Miljö!F288=TRUE,Miljö!$C$16/Miljö!F289,0)","v":0},{"$f":"IF(Miljö!G288=TRUE,Miljö!$C$16/Miljö!G289,0)","v":0},{"$f":"IF(Miljö!H288=TRUE,Miljö!$C$16/Miljö!H289,0)","v":0},{"$f":"IF(Miljö!I288=TRUE,Miljö!$C$16/Miljö!I289,0)","v":0},{"$f":"IF(Miljö!J288=TRUE,Miljö!$C$16/Miljö!J289,0)","v":0},{"$f":"IF(Miljö!K288=TRUE,Miljö!$C$16/Miljö!K289,0)","v":0},{"$f":"IF(Miljö!L288=TRUE,Miljö!$C$16/Miljö!L289,0)","v":0}]
["Radiatorer","st",{"$f":"IF(Miljö!C301=TRUE,Miljö!$C$16/Miljö!C302,0)","v":0},{"$f":"IF(Miljö!D301=TRUE,Miljö!$C$16/Miljö!D302,0)","v":0},{"$f":"IF(Miljö!E301=TRUE,Miljö!$C$16/Miljö!E302,0)","v":0},{"$f":"IF(Miljö!F301=TRUE,Miljö!$C$16/Miljö!F302,0)","v":0},{"$f":"IF(Miljö!G301=TRUE,Miljö!$C$16/Miljö!G302,0)","v":0},{"$f":"IF(Miljö!H301=TRUE,Miljö!$C$16/Miljö!H302,0)","v":0},{"$f":"IF(Miljö!I301=TRUE,Miljö!$C$16/Miljö!I302,0)","v":0},{"$f":"IF(Miljö!J301=TRUE,Miljö!$C$16/Miljö!J302,0)","v":0},{"$f":"IF(Miljö!K301=TRUE,Miljö!$C$16/Miljö!K302,0)","v":0},{"$f":"IF(Miljö!L301=TRUE,Miljö!$C$16/Miljö!L302,0)","v":0}]
["Kopparrör","st",{"$f":"IF(Miljö!C311=TRUE,Miljö!$C$16/Miljö!C312,0)","v":0},{"$f":"IF(Miljö!D311=TRUE,Miljö!$C$16/Miljö!D312,0)","v":0},{"$f":"IF(Miljö!E311=TRUE,Miljö!$C$16/Miljö!E312,0)","v":0},{"$f":"IF(Miljö!F311=TRUE,Miljö!$C$16/Miljö!F312,0)","v":0},{"$f":"IF(Miljö!G311=TRUE,Miljö!$C$16/Miljö!G312,0)","v":0},{"$f":"IF(Miljö!H311=TRUE,Miljö!$C$16/Miljö!H312,0)","v":0},{"$f":"IF(Miljö!I311=TRUE,Miljö!$C$16/Miljö!I312,0)","v":0},{"$f":"IF(Miljö!J311=TRUE,Miljö!$C$16/Miljö!J312,0)","v":0},{"$f":"IF(Miljö!K311=TRUE,Miljö!$C$16/Miljö!K312,0)","v":0},{"$f":"IF(Miljö!L311=TRUE,Miljö!$C$16/Miljö!L312,0)","v":0}]
["PEX-rör","st",{"$f":"IF(Miljö!C320=TRUE,Miljö!$C$16/Miljö!C321,0)","v":0},{"$f":"IF(Miljö!D320=TRUE,Miljö!$C$16/Miljö!D321,0)","v":0},{"$f":"IF(Miljö!E320=TRUE,Miljö!$C$16/Miljö!E321,0)","v":0},{"$f":"IF(Miljö!F320=TRUE,Miljö!$C$16/Miljö!F321,0)","v":0},{"$f":"IF(Miljö!G320=TRUE,Miljö!$C$16/Miljö!G321,0)","v":0},{"$f":"IF(Miljö!H320=TRUE,Miljö!$C$16/Miljö!H321,0)","v":0},{"$f":"IF(Miljö!I320=TRUE,Miljö!$C$16/Miljö!I321,0)","v":0},{"$f":"IF(Miljö!J320=TRUE,Miljö!$C$16/Miljö!J321,0)","v":0},{"$f":"IF(Miljö!K320=TRUE,Miljö!$C$16/Miljö!K321,0)","v":0},{"$f":"IF(Miljö!L320=TRUE,Miljö!$C$16/Miljö!L321,0)","v":0}]
["PP-rör","st",{"$f":"IF(Miljö!C329=TRUE,Miljö!$C$16/Miljö!C330,0)","v":0},{"$f":"IF(Miljö!D329=TRUE,Miljö!$C$16/Miljö!D330,0)","v":0},{"$f":"IF(Miljö!E329=TRUE,Miljö!$C$16/Miljö!E330,0)","v":0},{"$f":"IF(Miljö!F329=TRUE,Miljö!$C$16/Miljö!F330,0)","v":0},{"$f":"IF(Miljö!G329=TRUE,Miljö!$C$16/Miljö!G330,0)","v":0},{"$f":"IF(Miljö!H329=TRUE,Miljö!$C$16/Miljö!H330,0)","v":0},{"$f":"IF(Miljö!I329=TRUE,Miljö!$C$16/Miljö!I330,0)","v":0},{"$f":"IF(Miljö!J329=TRUE,Miljö!$C$16/Miljö!J330,0)","v":0},{"$f":"IF(Miljö!K329=TRUE,Miljö!$C$16/Miljö!K330,0)","v":0},{"$f":"IF(Miljö!L329=TRUE,Miljö!$C$16/Miljö!L330,0)","v":0}]
["Järnrör","st",{"$f":"IF(Miljö!C338=TRUE,Miljö!$C$16/Miljö!C339,0)","v":0},{"$f":"IF(Miljö!D338=TRUE,Miljö!$C$16/Miljö!D339,0)","v":0},{"$f":"IF(Miljö!E338=TRUE,Miljö!$C$16/Miljö!E339,0)","v":0},{"$f":"IF(Miljö!F338=TRUE,Miljö!$C$16/Miljö!F339,0)","v":0},{"$f":"IF(Miljö!G338=TRUE,Miljö!$C$16/Miljö!G339,0)","v":0},{"$f":"IF(Miljö!H338=TRUE,Miljö!$C$16/Miljö!H339,0)","v":0},{"$f":"IF(Miljö!I338=TRUE,Miljö!$C$16/Miljö!I339,0)","v":0},{"$f":"IF(Miljö!J338=TRUE,Miljö!$C$16/Miljö!J339,0)","v":0},{"$f":"IF(Miljö!K338=TRUE,Miljö!$C$16/Miljö!K339,0)","v":0},{"$f":"IF(Miljö!L338=TRUE,Miljö!$C$16/Miljö!L339,0)","v":0}]
["Stålrör","st",{"$f":"IF(Miljö!C347=TRUE,Miljö!$C$16/Miljö!C348,0)","v":0},{"$f":"IF(Miljö!D347=TRUE,Miljö!$C$16/Miljö!D348,0)","v":0},{"$f":"IF(Miljö!E347=TRUE,Miljö!$C$16/Miljö!E348,0)","v":0},{"$f":"IF(Miljö!F347=TRUE,Miljö!$C$16/Miljö!F348,0)","v":0},{"$f":"IF(Miljö!G347=TRUE,Miljö!$C$16/Miljö!G348,0)","v":0},{"$f":"IF(Miljö!H347=TRUE,Miljö!$C$16/Miljö!H348,0)","v":0},{"$f":"IF(Miljö!I347=TRUE,Miljö!$C$16/Miljö!I348,0)","v":0},{"$f":"IF(Miljö!J347=TRUE,Miljö!$C$16/Miljö!J348,0)","v":0},{"$f":"IF(Miljö!K347=TRUE,Miljö!$C$16/Miljö!K348,0)","v":0},{"$f":"IF(Miljö!L347=TRUE,Miljö!$C$16/Miljö!L348,0)","v":0}]
["Relining rör","st",{"$f":"IF(Miljö!C356=TRUE,Miljö!$C$16/Miljö!C357,0)","v":0},{"$f":"IF(Miljö!D356=TRUE,Miljö!$C$16/Miljö!D357,0)","v":0},{"$f":"IF(Miljö!E356=TRUE,Miljö!$C$16/Miljö!E357,0)","v":0},{"$f":"IF(Miljö!F356=TRUE,Miljö!$C$16/Miljö!F357,0)","v":0},{"$f":"IF(Miljö!G356=TRUE,Miljö!$C$16/Miljö!G357,0)","v":0},{"$f":"IF(Miljö!H356=TRUE,Miljö!$C$16/Miljö!H357,0)","v":0},{"$f":"IF(Miljö!I356=TRUE,Miljö!$C$16/Miljö!I357,0)","v":0},{"$f":"IF(Miljö!J356=TRUE,Miljö!$C$16/Miljö!J357,0)","v":0},{"$f":"IF(Miljö!K356=TRUE,Miljö!$C$16/Miljö!K357,0)","v":0},{"$f":"IF(Miljö!L356=TRUE,Miljö!$C$16/Miljö!L357,0)","v":0}]
["Elledning","st",{"$f":"IF(Miljö!C384=TRUE,Miljö!$C$16/Miljö!C385,0)","v":0},{"$f":"IF(Miljö!D384=TRUE,Miljö!$C$16/Miljö!D385,0)","v":0},{"$f":"IF(Miljö!E384=TRUE,Miljö!$C$16/Miljö!E385,0)","v":0},{"$f":"IF(Miljö!F384=TRUE,Miljö!$C$16/Miljö!F385,0)","v":0},{"$f":"IF(Miljö!G384=TRUE,Miljö!$C$16/Miljö!G385,0)","v":0},{"$f":"IF(Miljö!H384=TRUE,Miljö!$C$16/Miljö!H385,0)","v":0},{"$f":"IF(Miljö!I384=TRUE,Miljö!$C$16/Miljö!I385,0)","v":0},{"$f":"IF(Miljö!J384=TRUE,Miljö!$C$16/Miljö!J385,0)","v":0},{"$f":"IF(Miljö!K384=TRUE,Miljö!$C$16/Miljö!K385,0)","v":0},{"$f":"IF(Miljö!L384=TRUE,Miljö!$C$16/Miljö!L385,0)","v":0}]
["Egen elproduktion","st",{"$f":"IF(Miljö!C130=TRUE,Miljö!$C$16/Miljö!C131,0)","v":0},{"$f":"IF(Miljö!D130=TRUE,Miljö!$C$16/Miljö!D131,0)","v":0},{"$f":"IF(Miljö!E130=TRUE,Miljö!$C$16/Miljö!E131,0)","v":0},{"$f":"IF(Miljö!F130=TRUE,Miljö!$C$16/Miljö!F131,0)","v":0},{"$f":"IF(Miljö!G130=TRUE,Miljö!$C$16/Miljö!G131,0)","v":0},{"$f":"IF(Miljö!H130=TRUE,Miljö!$C$16/Miljö!H131,0)","v":0},{"$f":"IF(Miljö!I130=TRUE,Miljö!$C$16/Miljö!I131,0)","v":0},{"$f":"IF(Miljö!J130=TRUE,Miljö!$C$16/Miljö!J131,0)","v":0},{"$f":"IF(Miljö!K130=TRUE,Miljö!$C$16/Miljö!K131,0)","v":0},{"$f":"IF(Miljö!L130=TRUE,Miljö!$C$16/Miljö!L131,0)","v":0}]
[]
["7.2 Klimatpåverkan"]
["7.2.1 Miljöpåverkan renovering",null,{"$f":"Miljö!C91","v":"Referensfall"},{"$f":"Miljö!D91","v":""},{"$f":"Miljö!E91","v":""},{"$f":"Miljö!F91","v":""},{"$f":"Miljö!G91","v":""},{"$f":"Miljö!H91","v":""},{"$f":"Miljö!I91","v":""},{"$f":"Miljö!J91","v":""},{"$f":"Miljö!K91","v":""},{"$f":"Miljö!L91","v":""}]
["Materialanvändning+trp, isolering 1","kg CO2-eq",{"$f":"IF(Miljö!C151=TRUE,   INDEX(Material!$A$6:$G$9, MATCH(Miljö!C153,Material!$A6:$A9, 0),4)*Miljö!C154+Trp!C135, 0)","v":0},{"$f":"IF(Miljö!D151=TRUE,   INDEX(Material!$A$6:$G$9, MATCH(Miljö!D153,Material!$A6:$A9, 0),4)*Miljö!D154+Trp!D135, 0)","v":0},{"$f":"IF(Miljö!E151=TRUE,   INDEX(Material!$A$6:$G$9, MATCH(Miljö!E153,Material!$A6:$A9, 0),4)*Miljö!E154+Trp!E135, 0)","v":0},{"$f":"IF(Miljö!F151=TRUE,   INDEX(Material!$A$6:$G$9, MATCH(Miljö!F153,Material!$A6:$A9, 0),4)*Miljö!F154+Trp!F135, 0)","v":0},{"$f":"IF(Miljö!G151=TRUE,   INDEX(Material!$A$6:$G$9, MATCH(Miljö!G153,Material!$A6:$A9, 0),4)*Miljö!G154+Trp!G135, 0)","v":0},{"$f":"IF(Miljö!H151=TRUE,   INDEX(Material!$A$6:$G$9, MATCH(Miljö!H153,Material!$A6:$A9, 0),4)*Miljö!H154+Trp!H135, 0)","v":0},{"$f":"IF(Miljö!I151=TRUE,   INDEX(Material!$A$6:$G$9, MATCH(Miljö!I153,Material!$A6:$A9, 0),4)*Miljö!I154+Trp!I135, 0)","v":0},{"$f":"IF(Miljö!J151=TRUE,   INDEX(Material!$A$6:$G$9, MATCH(Miljö!J153,Material!$A6:$A9, 0),4)*Miljö!J154+Trp!J135, 0)","v":0},{"$f":"IF(Miljö!K151=TRUE,   INDEX(Material!$A$6:$G$9, MATCH(Miljö!K153,Material!$A6:$A9, 0),4)*Miljö!K154+Trp!K135, 0)","v":0},{"$f":"IF(Miljö!L151=TRUE,   INDEX(Material!$A$6:$G$9, MATCH(Miljö!L153,Material!$A6:$A9, 0),4)*Miljö!L154+Trp!L135, 0)","v":0}]
["Materialanvändning+trp, isolering 2","kg CO2-eq",{"$f":"IF(Miljö!C161=TRUE,   INDEX(Material!$A$6:$G$9, MATCH(Miljö!C163,Material!$A6:$A9, 0),4)*Miljö!C164+Trp!C136, 0)","v":0},{"$f":"IF(Miljö!D161=TRUE,   INDEX(Material!$A$6:$G$9, MATCH(Miljö!D163,Material!$A6:$A9, 0),4)*Miljö!D164+Trp!D136, 0)","v":0},{"$f":"IF(Miljö!E161=TRUE,   INDEX(Material!$A$6:$G$9, MATCH(Miljö!E163,Material!$A6:$A9, 0),4)*Miljö!E164+Trp!E136, 0)","v":0},{"$f":"IF(Miljö!F161=TRUE,   INDEX(Material!$A$6:$G$9, MATCH(Miljö!F163,Material!$A6:$A9, 0),4)*Miljö!F164+Trp!F136, 0)","v":0},{"$f":"IF(Miljö!G161=TRUE,   INDEX(Material!$A$6:$G$9, MATCH(Miljö!G163,Material!$A6:$A9, 0),4)*Miljö!G164+Trp!G136, 0)","v":0},{"$f":"IF(Miljö!H161=TRUE,   INDEX(Material!$A$6:$G$9, MATCH(Miljö!H163,Material!$A6:$A9, 0),4)*Miljö!H164+Trp!H136, 0)","v":0},{"$f":"IF(Miljö!I161=TRUE,   INDEX(Material!$A$6:$G$9, MATCH(Miljö!I163,Material!$A6:$A9, 0),4)*Miljö!I164+Trp!I136, 0)","v":0},{"$f":"IF(Miljö!J161=TRUE,   INDEX(Material!$A$6:$G$9, MATCH(Miljö!J163,Material!$A6:$A9, 0),4)*Miljö!J164+Trp!J136, 0)","v":0},{"$f":"IF(Miljö!K161=TRUE,   INDEX(Material!$A$6:$G$9, MATCH(Miljö!K163,Material!$A6:$A9, 0),4)*Miljö!K164+Trp!K136, 0)","v":0},{"$f":"IF(Miljö!L161=TRUE,   INDEX(Material!$A$6:$G$9, MATCH(Miljö!L163,Material!$A6:$A9, 0),4)*Miljö!L164+Trp!L136, 0)","v":0}]
["Materialanvändning+trp, fasadsystem","kg CO2-eq",{"$f":"IF(Miljö!C171=TRUE,  INDEX(Material!$A33:$G51, MATCH(Miljö!C173,Material!$A33:$A51, 0),4)*Miljö!C174+Trp!C137,  0)","v":0},{"$f":"IF(Miljö!D171=TRUE,  INDEX(Material!$A33:$G51, MATCH(Miljö!D173,Material!$A33:$A51, 0),4)*Miljö!D174+Trp!D137,  0)","v":0},{"$f":"IF(Miljö!E171=TRUE,  INDEX(Material!$A33:$G51, MATCH(Miljö!E173,Material!$A33:$A51, 0),4)*Miljö!E174+Trp!E137,  0)","v":0},{"$f":"IF(Miljö!F171=TRUE,  INDEX(Material!$A33:$G51, MATCH(Miljö!F173,Material!$A33:$A51, 0),4)*Miljö!F174+Trp!F137,  0)","v":0},{"$f":"IF(Miljö!G171=TRUE,  INDEX(Material!$A33:$G51, MATCH(Miljö!G173,Material!$A33:$A51, 0),4)*Miljö!G174+Trp!G137,  0)","v":0},{"$f":"IF(Miljö!H171=TRUE,  INDEX(Material!$A33:$G51, MATCH(Miljö!H173,Material!$A33:$A51, 0),4)*Miljö!H174+Trp!H137,  0)","v":0},{"$f":"IF(Miljö!I171=TRUE,  INDEX(Material!$A33:$G51, MATCH(Miljö!I173,Material!$A33:$A51, 0),4)*Miljö!I174+Trp!I137,  0)","v":0},{"$f":"IF(Miljö!J171=TRUE,  INDEX(Material!$A33:$G51, MATCH(Miljö!J173,Material!$A33:$A51, 0),4)*Miljö!J174+Trp!J137,  0)","v":0},{"$f":"IF(Miljö!K171=TRUE,  INDEX(Material!$A33:$G51, MATCH(Miljö!K173,Material!$A33:$A51, 0),4)*Miljö!K174+Trp!K137,  0)","v":0},{"$f":"IF(Miljö!L171=TRUE,  INDEX(Material!$A33:$G51, MATCH(Miljö!L173,Material!$A33:$A51, 0),4)*Miljö!L174+Trp!L137,  0)","v":0}]
["Materialanvändning+trp, fönster","kg CO2-eq",{"$f":"IF(Miljö!C181=TRUE,  INDEX(Material!$A15:$G18, MATCH(Miljö!C183,Material!$A15:$A18, 0),4)*Miljö!C184+Trp!C138,  0)","v":0},{"$f":"IF(Miljö!D181=TRUE,  INDEX(Material!$A15:$G18, MATCH(Miljö!D183,Material!$A15:$A18, 0),4)*Miljö!D184+Trp!D138,  0)","v":0},{"$f":"IF(Miljö!E181=TRUE,  INDEX(Material!$A15:$G18, MATCH(Miljö!E183,Material!$A15:$A18, 0),4)*Miljö!E184+Trp!E138,  0)","v":0},{"$f":"IF(Miljö!F181=TRUE,  INDEX(Material!$A15:$G18, MATCH(Miljö!F183,Material!$A15:$A18, 0),4)*Miljö!F184+Trp!F138,  0)","v":0},{"$f":"IF(Miljö!G181=TRUE,  INDEX(Material!$A15:$G18, MATCH(Miljö!G183,Material!$A15:$A18, 0),4)*Miljö!G184+Trp!G138,  0)","v":0},{"$f":"IF(Miljö!H181=TRUE,  INDEX(Material!$A15:$G18, MATCH(Miljö!H183,Material!$A15:$A18, 0),4)*Miljö!H184+Trp!H138,  0)","v":0},{"$f":"IF(Miljö!I181=TRUE,  INDEX(Material!$A15:$G18, MATCH(Miljö!I183,Material!$A15:$A18, 0),4)*Miljö!I184+Trp!I138,  0)","v":0},{"$f":"IF(Miljö!J181=TRUE,  INDEX(Material!$A15:$G18, MATCH(Miljö!J183,Material!$A15:$A18, 0),4)*Miljö!J184+Trp!J138,  0)","v":0},{"$f":"IF(Miljö!K181=TRUE,  INDEX(Material!$A15:$G18, MATCH(Miljö!K183,Material!$A15:$A18, 0),4)*Miljö!K184+Trp!K138,  0)","v":0},{"$f":"IF(Miljö!L181=TRUE,  INDEX(Material!$A15:$G18, MATCH(Miljö!L183,Material!$A15:$A18, 0),4)*Miljö!L184+Trp!L138,  0)","v":0}]
["Materialanvändning+trp, dörrar","kg CO2-eq",{"$f":"IF(Miljö!C191=TRUE,  INDEX(Material!$A24:$G27, MATCH(Miljö!C193,Material!$A15:$A18, 0),4)*Miljö!C194+Trp!C139,  0)","v":0},{"$f":"IF(Miljö!D191=TRUE,  INDEX(Material!$A24:$G27, MATCH(Miljö!D193,Material!$A15:$A18, 0),4)*Miljö!D194+Trp!D139,  0)","v":0},{"$f":"IF(Miljö!E191=TRUE,  INDEX(Material!$A24:$G27, MATCH(Miljö!E193,Material!$A15:$A18, 0),4)*Miljö!E194+Trp!E139,  0)","v":0},{"$f":"IF(Miljö!F191=TRUE,  INDEX(Material!$A24:$G27, MATCH(Miljö!F193,Material!$A15:$A18, 0),4)*Miljö!F194+Trp!F139,  0)","v":0},{"$f":"IF(Miljö!G191=TRUE,  INDEX(Material!$A24:$G27, MATCH(Miljö!G193,Material!$A15:$A18, 0),4)*Miljö!G194+Trp!G139,  0)","v":0},{"$f":"IF(Miljö!H191=TRUE,  INDEX(Material!$A24:$G27, MATCH(Miljö!H193,Material!$A15:$A18, 0),4)*Miljö!H194+Trp!H139,  0)","v":0},{"$f":"IF(Miljö!I191=TRUE,  INDEX(Material!$A24:$G27, MATCH(Miljö!I193,Material!$A15:$A18, 0),4)*Miljö!I194+Trp!I139,  0)","v":0},{"$f":"IF(Miljö!J191=TRUE,  INDEX(Material!$A24:$G27, MATCH(Miljö!J193,Material!$A15:$A18, 0),4)*Miljö!J194+Trp!J139,  0)","v":0},{"$f":"IF(Miljö!K191=TRUE,  INDEX(Material!$A24:$G27, MATCH(Miljö!K193,Material!$A15:$A18, 0),4)*Miljö!K194+Trp!K139,  0)","v":0},{"$f":"IF(Miljö!L191=TRUE,  INDEX(Material!$A24:$G27, MATCH(Miljö!L193,Material!$A15:$A18, 0),4)*Miljö!L194+Trp!L139,  0)","v":0}]
["Materialanvändning+trp, byte uppvärmning värmeprod","kg CO2-eq",{"$f":"IF(Miljö!C98=TRUE,INDEX(Uppvärmning!$A$30:$M$36, MATCH(Miljö!C94,Uppvärmning!$A$30:$A$36, 0),4) +Trp!C140,  0)","v":0},{"$f":"IF(Miljö!D98=TRUE,INDEX(Uppvärmning!$A$30:$M$36, MATCH(Miljö!D94,Uppvärmning!$A$30:$A$36, 0),5) +Trp!D140,  0)","v":0},{"$f":"IF(Miljö!E98=TRUE,INDEX(Uppvärmning!$A$30:$M$36, MATCH(Miljö!E94,Uppvärmning!$A$30:$A$36, 0),6) +Trp!E140,  0)","v":0},{"$f":"IF(Miljö!F98=TRUE,INDEX(Uppvärmning!$A$30:$M$36, MATCH(Miljö!F94,Uppvärmning!$A$30:$A$36, 0),7) +Trp!F140,  0)","v":0},{"$f":"IF(Miljö!G98=TRUE,INDEX(Uppvärmning!$A$30:$M$36, MATCH(Miljö!G94,Uppvärmning!$A$30:$A$36, 0),8) +Trp!G140,  0)","v":0},{"$f":"IF(Miljö!H98=TRUE,INDEX(Uppvärmning!$A$30:$M$36, MATCH(Miljö!H94,Uppvärmning!$A$30:$A$36, 0),9) +Trp!H140,  0)","v":0},{"$f":"IF(Miljö!I98=TRUE,INDEX(Uppvärmning!$A$30:$M$36, MATCH(Miljö!I94,Uppvärmning!$A$30:$A$36, 0),10) +Trp!I140,  0)","v":0},{"$f":"IF(Miljö!J98=TRUE,INDEX(Uppvärmning!$A$30:$M$36, MATCH(Miljö!J94,Uppvärmning!$A$30:$A$36, 0),11) +Trp!J140,  0)","v":0},{"$f":"IF(Miljö!K98=TRUE,INDEX(Uppvärmning!$A$30:$M$36, MATCH(Miljö!K94,Uppvärmning!$A$30:$A$36, 0),12) +Trp!K140,  0)","v":0},{"$f":"IF(Miljö!L98=TRUE,INDEX(Uppvärmning!$A$30:$M$36, MATCH(Miljö!L94,Uppvärmning!$A$30:$A$36, 0),13) +Trp!L140,  0)","v":0}]
["Materialanv.+trp, byte uppvärmningsform kringmaterial","kg CO2-eq",{"$f":"IF(Miljö!C98=TRUE,IF(Miljö!C94=1,Uppvärmning!D37,  IF(Miljö!C94=3,Uppvärmning!D38, IF(Miljö!C94=4,Uppvärmning!D39,   IF(Miljö!C94=5,Uppvärmning!D40,     0)))),0)","v":0},{"$f":"IF(Miljö!D98=TRUE,IF(Miljö!D94=1,Uppvärmning!E37,  IF(Miljö!D94=3,Uppvärmning!E38, IF(Miljö!D94=4,Uppvärmning!E39,   IF(Miljö!D94=5,Uppvärmning!E40,     0)))),0)","v":0},{"$f":"IF(Miljö!E98=TRUE,IF(Miljö!E94=1,Uppvärmning!F37,  IF(Miljö!E94=3,Uppvärmning!F38, IF(Miljö!E94=4,Uppvärmning!F39,   IF(Miljö!E94=5,Uppvärmning!F40,     0)))),0)","v":0},{"$f":"IF(Miljö!F98=TRUE,IF(Miljö!F94=1,Uppvärmning!G37,  IF(Miljö!F94=3,Uppvärmning!G38, IF(Miljö!F94=4,Uppvärmning!G39,   IF(Miljö!F94=5,Uppvärmning!G40,     0)))),0)","v":0},{"$f":"IF(Miljö!G98=TRUE,IF(Miljö!G94=1,Uppvärmning!H37,  IF(Miljö!G94=3,Uppvärmning!H38, IF(Miljö!G94=4,Uppvärmning!H39,   IF(Miljö!G94=5,Uppvärmning!H40,     0)))),0)","v":0},{"$f":"IF(Miljö!H98=TRUE,IF(Miljö!H94=1,Uppvärmning!I37,  IF(Miljö!H94=3,Uppvärmning!I38, IF(Miljö!H94=4,Uppvärmning!I39,   IF(Miljö!H94=5,Uppvärmning!I40,     0)))),0)","v":0},{"$f":"IF(Miljö!I98=TRUE,IF(Miljö!I94=1,Uppvärmning!J37,  IF(Miljö!I94=3,Uppvärmning!J38, IF(Miljö!I94=4,Uppvärmning!J39,   IF(Miljö!I94=5,Uppvärmning!J40,     0)))),0)","v":0},{"$f":"IF(Miljö!J98=TRUE,IF(Miljö!J94=1,Uppvärmning!K37,  IF(Miljö!J94=3,Uppvärmning!K38, IF(Miljö!J94=4,Uppvärmning!K39,   IF(Miljö!J94=5,Uppvärmning!K40,     0)))),0)","v":0},{"$f":"IF(Miljö!K98=TRUE,IF(Miljö!K94=1,Uppvärmning!L37,  IF(Miljö!K94=3,Uppvärmning!L38, IF(Miljö!K94=4,Uppvärmning!L39,   IF(Miljö!K94=5,Uppvärmning!L40,     0)))),0)","v":0},{"$f":"IF(Miljö!L98=TRUE,IF(Miljö!L94=1,Uppvärmning!M37,  IF(Miljö!L94=3,Uppvärmning!M38, IF(Miljö!L94=4,Uppvärmning!M39,   IF(Miljö!L94=5,Uppvärmning!M40,     0)))),0)","v":0}]
["Materialanvändning+trp, cirkulationspump","kg CO2-eq",{"$f":"IF(Miljö!C111=TRUE,Miljö!C$113*Material!$D$138 +Trp!C$141,  0)","v":0},{"$f":"IF(Miljö!D111=TRUE,Miljö!D$113*Material!$D$138 +Trp!D$141,  0)","v":0},{"$f":"IF(Miljö!E111=TRUE,Miljö!E$113*Material!$D$138 +Trp!E$141,  0)","v":0},{"$f":"IF(Miljö!F111=TRUE,Miljö!F$113*Material!$D$138 +Trp!F$141,  0)","v":0},{"$f":"IF(Miljö!G111=TRUE,Miljö!G$113*Material!$D$138 +Trp!G$141,  0)","v":0},{"$f":"IF(Miljö!H111=TRUE,Miljö!H$113*Material!$D$138 +Trp!H$141,  0)","v":0},{"$f":"IF(Miljö!I111=TRUE,Miljö!I$113*Material!$D$138 +Trp!I$141,  0)","v":0},{"$f":"IF(Miljö!J111=TRUE,Miljö!J$113*Material!$D$138 +Trp!J$141,  0)","v":0},{"$f":"IF(Miljö!K111=TRUE,Miljö!K$113*Material!$D$138 +Trp!K$141,  0)","v":0},{"$f":"IF(Miljö!L111=TRUE,Miljö!L$113*Material!$D$138 +Trp!L$141,  0)","v":0}]
["Materialanvändning+trp, ventilationskanaler","kg CO2-eq",{"$f":"IF(Miljö!C365=TRUE,  INDEX(Material!$A110:$G113, MATCH(Miljö!C367,Material!$A110:$A113, 0),4)*Miljö!C368+Trp!C142,0)","v":0},{"$f":"IF(Miljö!D365=TRUE,  INDEX(Material!$A110:$G113, MATCH(Miljö!D367,Material!$A110:$A113, 0),4)*Miljö!D368+Trp!D142,0)","v":0},{"$f":"IF(Miljö!E365=TRUE,  INDEX(Material!$A110:$G113, MATCH(Miljö!E367,Material!$A110:$A113, 0),4)*Miljö!E368+Trp!E142,0)","v":0},{"$f":"IF(Miljö!F365=TRUE,  INDEX(Material!$A110:$G113, MATCH(Miljö!F367,Material!$A110:$A113, 0),4)*Miljö!F368+Trp!F142,0)","v":0},{"$f":"IF(Miljö!G365=TRUE,  INDEX(Material!$A110:$G113, MATCH(Miljö!G367,Material!$A110:$A113, 0),4)*Miljö!G368+Trp!G142,0)","v":0},{"$f":"IF(Miljö!H365=TRUE,  INDEX(Material!$A110:$G113, MATCH(Miljö!H367,Material!$A110:$A113, 0),4)*Miljö!H368+Trp!H142,0)","v":0},{"$f":"IF(Miljö!I365=TRUE,  INDEX(Material!$A110:$G113, MATCH(Miljö!I367,Material!$A110:$A113, 0),4)*Miljö!I368+Trp!I142,0)","v":0},{"$f":"IF(Miljö!J365=TRUE,  INDEX(Material!$A110:$G113, MATCH(Miljö!J367,Material!$A110:$A113, 0),4)*Miljö!J368+Trp!J142,0)","v":0},{"$f":"IF(Miljö!K365=TRUE,  INDEX(Material!$A110:$G113, MATCH(Miljö!K367,Material!$A110:$A113, 0),4)*Miljö!K368+Trp!K142,0)","v":0},{"$f":"IF(Miljö!L365=TRUE,  INDEX(Material!$A110:$G113, MATCH(Miljö!L367,Material!$A110:$A113, 0),4)*Miljö!L368+Trp!L142,0)","v":0}]
["Materialanvändning+trp, luftflödesaggregat","kg CO2-eq",{"$f":"IF(Miljö!C120=TRUE,  INDEX(Material!$A119:$G122, MATCH(Miljö!C122,Material!$A119:$A122, 0),4)*Miljö!C123+Trp!C143,0)","v":0},{"$f":"IF(Miljö!D120=TRUE,  INDEX(Material!$A119:$G122, MATCH(Miljö!D122,Material!$A119:$A122, 0),4)*Miljö!D123+Trp!D143,0)","v":0},{"$f":"IF(Miljö!E120=TRUE,  INDEX(Material!$A119:$G122, MATCH(Miljö!E122,Material!$A119:$A122, 0),4)*Miljö!E123+Trp!E143,0)","v":0},{"$f":"IF(Miljö!F120=TRUE,  INDEX(Material!$A119:$G122, MATCH(Miljö!F122,Material!$A119:$A122, 0),4)*Miljö!F123+Trp!F143,0)","v":0},{"$f":"IF(Miljö!G120=TRUE,  INDEX(Material!$A119:$G122, MATCH(Miljö!G122,Material!$A119:$A122, 0),4)*Miljö!G123+Trp!G143,0)","v":0},{"$f":"IF(Miljö!H120=TRUE,  INDEX(Material!$A119:$G122, MATCH(Miljö!H122,Material!$A119:$A122, 0),4)*Miljö!H123+Trp!H143,0)","v":0},{"$f":"IF(Miljö!I120=TRUE,  INDEX(Material!$A119:$G122, MATCH(Miljö!I122,Material!$A119:$A122, 0),4)*Miljö!I123+Trp!I143,0)","v":0},{"$f":"IF(Miljö!J120=TRUE,  INDEX(Material!$A119:$G122, MATCH(Miljö!J122,Material!$A119:$A122, 0),4)*Miljö!J123+Trp!J143,0)","v":0},{"$f":"IF(Miljö!K120=TRUE,  INDEX(Material!$A119:$G122, MATCH(Miljö!K122,Material!$A119:$A122, 0),4)*Miljö!K123+Trp!K143,0)","v":0},{"$f":"IF(Miljö!L120=TRUE,  INDEX(Material!$A119:$G122, MATCH(Miljö!L122,Material!$A119:$A122, 0),4)*Miljö!L123+Trp!L143,0)","v":0}]
["Materialanvändning+trp, don och dämpare (vent)","kg CO2-eq",{"$f":"IF(Miljö!C375=TRUE,Material!$D$128*Miljö!C377+Trp!C144,0)","v":0},{"$f":"IF(Miljö!D375=TRUE,Material!$D$128*Miljö!D377+Trp!D144,0)","v":0},{"$f":"IF(Miljö!E375=TRUE,Material!$D$128*Miljö!E377+Trp!E144,0)","v":0},{"$f":"IF(Miljö!F375=TRUE,Material!$D$128*Miljö!F377+Trp!F144,0)","v":0},{"$f":"IF(Miljö!G375=TRUE,Material!$D$128*Miljö!G377+Trp!G144,0)","v":0},{"$f":"IF(Miljö!H375=TRUE,Material!$D$128*Miljö!H377+Trp!H144,0)","v":0},{"$f":"IF(Miljö!I375=TRUE,Material!$D$128*Miljö!I377+Trp!I144,0)","v":0},{"$f":"IF(Miljö!J375=TRUE,Material!$D$128*Miljö!J377+Trp!J144,0)","v":0},{"$f":"IF(Miljö!K375=TRUE,Material!$D$128*Miljö!K377+Trp!K144,0)","v":0},{"$f":"IF(Miljö!L375=TRUE,Material!$D$128*Miljö!L377+Trp!L144,0)","v":0}]
["Trä konstruktionsvirke","kg CO2-eq",{"$f":"IF(Miljö!C$204=TRUE,Material!$D$57*Miljö!C$206+Trp!C147,0)","v":0},{"$f":"IF(Miljö!D$204=TRUE,Material!$D$57*Miljö!D$206+Trp!D147,0)","v":0},{"$f":"IF(Miljö!E$204=TRUE,Material!$D$57*Miljö!E$206+Trp!E147,0)","v":0},{"$f":"IF(Miljö!F$204=TRUE,Material!$D$57*Miljö!F$206+Trp!F147,0)","v":0},{"$f":"IF(Miljö!G$204=TRUE,Material!$D$57*Miljö!G$206+Trp!G147,0)","v":0},{"$f":"IF(Miljö!H$204=TRUE,Material!$D$57*Miljö!H$206+Trp!H147,0)","v":0},{"$f":"IF(Miljö!I$204=TRUE,Material!$D$57*Miljö!I$206+Trp!I147,0)","v":0},{"$f":"IF(Miljö!J$204=TRUE,Material!$D$57*Miljö!J$206+Trp!J147,0)","v":0},{"$f":"IF(Miljö!K$204=TRUE,Material!$D$57*Miljö!K$206+Trp!K147,0)","v":0},{"$f":"IF(Miljö!L$204=TRUE,Material!$D$57*Miljö!L$206+Trp!L147,0)","v":0}]
["Trä målad träfasad","kg CO2-eq",{"$f":"IF(Miljö!C$213=TRUE,Material!$D$58*Miljö!C$215+Trp!C148,0)","v":0},{"$f":"IF(Miljö!D$213=TRUE,Material!$D$58*Miljö!D$215+Trp!D148,0)","v":0},{"$f":"IF(Miljö!E$213=TRUE,Material!$D$58*Miljö!E$215+Trp!E148,0)","v":0},{"$f":"IF(Miljö!F$213=TRUE,Material!$D$58*Miljö!F$215+Trp!F148,0)","v":0},{"$f":"IF(Miljö!G$213=TRUE,Material!$D$58*Miljö!G$215+Trp!G148,0)","v":0},{"$f":"IF(Miljö!H$213=TRUE,Material!$D$58*Miljö!H$215+Trp!H148,0)","v":0},{"$f":"IF(Miljö!I$213=TRUE,Material!$D$58*Miljö!I$215+Trp!I148,0)","v":0},{"$f":"IF(Miljö!J$213=TRUE,Material!$D$58*Miljö!J$215+Trp!J148,0)","v":0},{"$f":"IF(Miljö!K$213=TRUE,Material!$D$58*Miljö!K$215+Trp!K148,0)","v":0},{"$f":"IF(Miljö!L$213=TRUE,Material!$D$58*Miljö!L$215+Trp!L148,0)","v":0}]
["Trä invändig träpanel","kg CO2-eq",{"$f":"IF(Miljö!C$222=TRUE,Material!$D$59*Miljö!C$224+Trp!C149,0)","v":0},{"$f":"IF(Miljö!D$222=TRUE,Material!$D$59*Miljö!D$224+Trp!D149,0)","v":0},{"$f":"IF(Miljö!E$222=TRUE,Material!$D$59*Miljö!E$224+Trp!E149,0)","v":0},{"$f":"IF(Miljö!F$222=TRUE,Material!$D$59*Miljö!F$224+Trp!F149,0)","v":0},{"$f":"IF(Miljö!G$222=TRUE,Material!$D$59*Miljö!G$224+Trp!G149,0)","v":0},{"$f":"IF(Miljö!H$222=TRUE,Material!$D$59*Miljö!H$224+Trp!H149,0)","v":0},{"$f":"IF(Miljö!I$222=TRUE,Material!$D$59*Miljö!I$224+Trp!I149,0)","v":0},{"$f":"IF(Miljö!J$222=TRUE,Material!$D$59*Miljö!J$224+Trp!J149,0)","v":0},{"$f":"IF(Miljö!K$222=TRUE,Material!$D$59*Miljö!K$224+Trp!K149,0)","v":0},{"$f":"IF(Miljö!L$222=TRUE,Material!$D$59*Miljö!L$224+Trp!L149,0)","v":0}]
["Betong bjälklag","kg CO2-eq",{"$f":"IF(Miljö!C$231=TRUE,INDEX(Material!$A$65:$G$67,MATCH(Miljö!C$233,Material!$A$65:$A$67,0),4)*Miljö!C$234+Trp!C150,0)","v":0},{"$f":"IF(Miljö!D$231=TRUE,INDEX(Material!$A$65:$G$67,MATCH(Miljö!D$233,Material!$A$65:$A$67,0),4)*Miljö!D$234+Trp!D150,0)","v":0},{"$f":"IF(Miljö!E$231=TRUE,INDEX(Material!$A$65:$G$67,MATCH(Miljö!E$233,Material!$A$65:$A$67,0),4)*Miljö!E$234+Trp!E150,0)","v":0},{"$f":"IF(Miljö!F$231=TRUE,INDEX(Material!$A$65:$G$67,MATCH(Miljö!F$233,Material!$A$65:$A$67,0),4)*Miljö!F$234+Trp!F150,0)","v":0},{"$f":"IF(Miljö!G$231=TRUE,INDEX(Material!$A$65:$G$67,MATCH(Miljö!G$233,Material!$A$65:$A$67,0),4)*Miljö!G$234+Trp!G150,0)","v":0},{"$f":"IF(Miljö!H$231=TRUE,INDEX(Material!$A$65:$G$67,MATCH(Miljö!H$233,Material!$A$65:$A$67,0),4)*Miljö!H$234+Trp!H150,0)","v":0},{"$f":"IF(Miljö!I$231=TRUE,INDEX(Material!$A$65:$G$67,MATCH(Miljö!I$233,Material!$A$65:$A$67,0),4)*Miljö!I$234+Trp!I150,0)","v":0},{"$f":"IF(Miljö!J$231=TRUE,INDEX(Material!$A$65:$G$67,MATCH(Miljö!J$233,Material!$A$65:$A$67,0),4)*Miljö!J$234+Trp!J150,0)","v":0},{"$f":"IF(Miljö!K$231=TRUE,INDEX(Material!$A$65:$G$67,MATCH(Miljö!K$233,Material!$A$65:$A$67,0),4)*Miljö!K$234+Trp!K150,0)","v":0},{"$f":"IF(Miljö!L$231=TRUE,INDEX(Material!$A$65:$G$67,MATCH(Miljö!L$233,Material!$A$65:$A$67,0),4)*Miljö!L$234+Trp!L150,0)","v":0}]
["Betong bärande ytterväggar","kg CO2-eq",{"$f":"IF(Miljö!C$241=TRUE,INDEX(Material!$A$74:$G$75,MATCH(Miljö!C$243,Material!$A$74:$A$75,0),4)*Miljö!C$244+Trp!C151,0)","v":0},{"$f":"IF(Miljö!D$241=TRUE,INDEX(Material!$A$74:$G$75,MATCH(Miljö!D$243,Material!$A$74:$A$75,0),4)*Miljö!D$244+Trp!D151,0)","v":0},{"$f":"IF(Miljö!E$241=TRUE,INDEX(Material!$A$74:$G$75,MATCH(Miljö!E$243,Material!$A$74:$A$75,0),4)*Miljö!E$244+Trp!E151,0)","v":0},{"$f":"IF(Miljö!F$241=TRUE,INDEX(Material!$A$74:$G$75,MATCH(Miljö!F$243,Material!$A$74:$A$75,0),4)*Miljö!F$244+Trp!F151,0)","v":0},{"$f":"IF(Miljö!G$241=TRUE,INDEX(Material!$A$74:$G$75,MATCH(Miljö!G$243,Material!$A$74:$A$75,0),4)*Miljö!G$244+Trp!G151,0)","v":0},{"$f":"IF(Miljö!H$241=TRUE,INDEX(Material!$A$74:$G$75,MATCH(Miljö!H$243,Material!$A$74:$A$75,0),4)*Miljö!H$244+Trp!H151,0)","v":0},{"$f":"IF(Miljö!I$241=TRUE,INDEX(Material!$A$74:$G$75,MATCH(Miljö!I$243,Material!$A$74:$A$75,0),4)*Miljö!I$244+Trp!I151,0)","v":0},{"$f":"IF(Miljö!J$241=TRUE,INDEX(Material!$A$74:$G$75,MATCH(Miljö!J$243,Material!$A$74:$A$75,0),4)*Miljö!J$244+Trp!J151,0)","v":0},{"$f":"IF(Miljö!K$241=TRUE,INDEX(Material!$A$74:$G$75,MATCH(Miljö!K$243,Material!$A$74:$A$75,0),4)*Miljö!K$244+Trp!K151,0)","v":0},{"$f":"IF(Miljö!L$241=TRUE,INDEX(Material!$A$74:$G$75,MATCH(Miljö!L$243,Material!$A$74:$A$75,0),4)*Miljö!L$244+Trp!L151,0)","v":0}]
["Betong icke-bärande ytterväggar","kg CO2-eq",{"$f":"IF(Miljö!C$251=TRUE,Material!$D$77*Miljö!C$253+Trp!C152,0)","v":0},{"$f":"IF(Miljö!D$251=TRUE,Material!$D$77*Miljö!D$253+Trp!D152,0)","v":0},{"$f":"IF(Miljö!E$251=TRUE,Material!$D$77*Miljö!E$253+Trp!E152,0)","v":0},{"$f":"IF(Miljö!F$251=TRUE,Material!$D$77*Miljö!F$253+Trp!F152,0)","v":0},{"$f":"IF(Miljö!G$251=TRUE,Material!$D$77*Miljö!G$253+Trp!G152,0)","v":0},{"$f":"IF(Miljö!H$251=TRUE,Material!$D$77*Miljö!H$253+Trp!H152,0)","v":0},{"$f":"IF(Miljö!I$251=TRUE,Material!$D$77*Miljö!I$253+Trp!I152,0)","v":0},{"$f":"IF(Miljö!J$251=TRUE,Material!$D$77*Miljö!J$253+Trp!J152,0)","v":0},{"$f":"IF(Miljö!K$251=TRUE,Material!$D$77*Miljö!K$253+Trp!K152,0)","v":0},{"$f":"IF(Miljö!L$251=TRUE,Material!$D$77*Miljö!L$253+Trp!L152,0)","v":0}]
["Betong innerväggar","kg CO2-eq",{"$f":"IF(Miljö!C$260=TRUE,INDEX(Material!$A$84:$G$85,MATCH(Miljö!C$262,Material!$A$84:$A$85,0),4)*Miljö!C$263+Trp!C153,0)","v":0},{"$f":"IF(Miljö!D$260=TRUE,INDEX(Material!$A$84:$G$85,MATCH(Miljö!D$262,Material!$A$84:$A$85,0),4)*Miljö!D$263+Trp!D153,0)","v":0},{"$f":"IF(Miljö!E$260=TRUE,INDEX(Material!$A$84:$G$85,MATCH(Miljö!E$262,Material!$A$84:$A$85,0),4)*Miljö!E$263+Trp!E153,0)","v":0},{"$f":"IF(Miljö!F$260=TRUE,INDEX(Material!$A$84:$G$85,MATCH(Miljö!F$262,Material!$A$84:$A$85,0),4)*Miljö!F$263+Trp!F153,0)","v":0},{"$f":"IF(Miljö!G$260=TRUE,INDEX(Material!$A$84:$G$85,MATCH(Miljö!G$262,Material!$A$84:$A$85,0),4)*Miljö!G$263+Trp!G153,0)","v":0},{"$f":"IF(Miljö!H$260=TRUE,INDEX(Material!$A$84:$G$85,MATCH(Miljö!H$262,Material!$A$84:$A$85,0),4)*Miljö!H$263+Trp!H153,0)","v":0},{"$f":"IF(Miljö!I$260=TRUE,INDEX(Material!$A$84:$G$85,MATCH(Miljö!I$262,Material!$A$84:$A$85,0),4)*Miljö!I$263+Trp!I153,0)","v":0},{"$f":"IF(Miljö!J$260=TRUE,INDEX(Material!$A$84:$G$85,MATCH(Miljö!J$262,Material!$A$84:$A$85,0),4)*Miljö!J$263+Trp!J153,0)","v":0},{"$f":"IF(Miljö!K$260=TRUE,INDEX(Material!$A$84:$G$85,MATCH(Miljö!K$262,Material!$A$84:$A$85,0),4)*Miljö!K$263+Trp!K153,0)","v":0},{"$f":"IF(Miljö!L$260=TRUE,INDEX(Material!$A$84:$G$85,MATCH(Miljö!L$262,Material!$A$84:$A$85,0),4)*Miljö!L$263+Trp!L153,0)","v":0}]
["Puts","kg CO2-eq",{"$f":"IF(Miljö!C$270=TRUE,Material!$D$90*Miljö!C$272+Trp!C154,0)","v":0},{"$f":"IF(Miljö!D$270=TRUE,Material!$D$90*Miljö!D$272+Trp!D154,0)","v":0},{"$f":"IF(Miljö!E$270=TRUE,Material!$D$90*Miljö!E$272+Trp!E154,0)","v":0},{"$f":"IF(Miljö!F$270=TRUE,Material!$D$90*Miljö!F$272+Trp!F154,0)","v":0},{"$f":"IF(Miljö!G$270=TRUE,Material!$D$90*Miljö!G$272+Trp!G154,0)","v":0},{"$f":"IF(Miljö!H$270=TRUE,Material!$D$90*Miljö!H$272+Trp!H154,0)","v":0},{"$f":"IF(Miljö!I$270=TRUE,Material!$D$90*Miljö!I$272+Trp!I154,0)","v":0},{"$f":"IF(Miljö!J$270=TRUE,Material!$D$90*Miljö!J$272+Trp!J154,0)","v":0},{"$f":"IF(Miljö!K$270=TRUE,Material!$D$90*Miljö!K$272+Trp!K154,0)","v":0},{"$f":"IF(Miljö!L$270=TRUE,Material!$D$90*Miljö!L$272+Trp!L154,0)","v":0}]
["Gipsskivor","kg CO2-eq",{"$f":"IF(Miljö!C$279=TRUE,Material!$D$91*Miljö!C$281+Trp!C155,0)","v":0},{"$f":"IF(Miljö!D$279=TRUE,Material!$D$91*Miljö!D$281+Trp!D155,0)","v":0},{"$f":"IF(Miljö!E$279=TRUE,Material!$D$91*Miljö!E$281+Trp!E155,0)","v":0},{"$f":"IF(Miljö!F$279=TRUE,Material!$D$91*Miljö!F$281+Trp!F155,0)","v":0},{"$f":"IF(Miljö!G$279=TRUE,Material!$D$91*Miljö!G$281+Trp!G155,0)","v":0},{"$f":"IF(Miljö!H$279=TRUE,Material!$D$91*Miljö!H$281+Trp!H155,0)","v":0},{"$f":"IF(Miljö!I$279=TRUE,Material!$D$91*Miljö!I$281+Trp!I155,0)","v":0},{"$f":"IF(Miljö!J$279=TRUE,Material!$D$91*Miljö!J$281+Trp!J155,0)","v":0},{"$f":"IF(Miljö!K$279=TRUE,Material!$D$91*Miljö!K$281+Trp!K155,0)","v":0},{"$f":"IF(Miljö!L$279=TRUE,Material!$D$91*Miljö!L$281+Trp!L155,0)","v":0}]
["Takbeläggning","kg CO2-eq",{"$f":"IF(Miljö!C$288=TRUE,INDEX(Material!$A$98:$G$102,MATCH(Miljö!C$290,Material!$A$98:$A$102,0),4)*Miljö!C$291+Trp!C156,0)","v":0},{"$f":"IF(Miljö!D$288=TRUE,INDEX(Material!$A$98:$G$102,MATCH(Miljö!D$290,Material!$A$98:$A$102,0),4)*Miljö!D$291+Trp!D156,0)","v":0},{"$f":"IF(Miljö!E$288=TRUE,INDEX(Material!$A$98:$G$102,MATCH(Miljö!E$290,Material!$A$98:$A$102,0),4)*Miljö!E$291+Trp!E156,0)","v":0},{"$f":"IF(Miljö!F$288=TRUE,INDEX(Material!$A$98:$G$102,MATCH(Miljö!F$290,Material!$A$98:$A$102,0),4)*Miljö!F$291+Trp!F156,0)","v":0},{"$f":"IF(Miljö!G$288=TRUE,INDEX(Material!$A$98:$G$102,MATCH(Miljö!G$290,Material!$A$98:$A$102,0),4)*Miljö!G$291+Trp!G156,0)","v":0},{"$f":"IF(Miljö!H$288=TRUE,INDEX(Material!$A$98:$G$102,MATCH(Miljö!H$290,Material!$A$98:$A$102,0),4)*Miljö!H$291+Trp!H156,0)","v":0},{"$f":"IF(Miljö!I$288=TRUE,INDEX(Material!$A$98:$G$102,MATCH(Miljö!I$290,Material!$A$98:$A$102,0),4)*Miljö!I$291+Trp!I156,0)","v":0},{"$f":"IF(Miljö!J$288=TRUE,INDEX(Material!$A$98:$G$102,MATCH(Miljö!J$290,Material!$A$98:$A$102,0),4)*Miljö!J$291+Trp!J156,0)","v":0},{"$f":"IF(Miljö!K$288=TRUE,INDEX(Material!$A$98:$G$102,MATCH(Miljö!K$290,Material!$A$98:$A$102,0),4)*Miljö!K$291+Trp!K156,0)","v":0},{"$f":"IF(Miljö!L$288=TRUE,INDEX(Material!$A$98:$G$102,MATCH(Miljö!L$290,Material!$A$98:$A$102,0),4)*Miljö!L$291+Trp!L156,0)","v":0}]
["Materialanvändning+trp, radiatorer","kg CO2-eq",{"$f":"IF(Miljö!C301=TRUE,  INDEX(Material!$A$146:$G$149, MATCH(Miljö!C303,Material!$A$146:$A$149, 0),4)*Miljö!C304+Trp!C157, 0)","v":0},{"$f":"IF(Miljö!D301=TRUE,  INDEX(Material!$A$146:$G$149, MATCH(Miljö!D303,Material!$A$146:$A$149, 0),4)*Miljö!D304+Trp!D157, 0)","v":0},{"$f":"IF(Miljö!E301=TRUE,  INDEX(Material!$A$146:$G$149, MATCH(Miljö!E303,Material!$A$146:$A$149, 0),4)*Miljö!E304+Trp!E157, 0)","v":0},{"$f":"IF(Miljö!F301=TRUE,  INDEX(Material!$A$146:$G$149, MATCH(Miljö!F303,Material!$A$146:$A$149, 0),4)*Miljö!F304+Trp!F157, 0)","v":0},{"$f":"IF(Miljö!G301=TRUE,  INDEX(Material!$A$146:$G$149, MATCH(Miljö!G303,Material!$A$146:$A$149, 0),4)*Miljö!G304+Trp!G157, 0)","v":0},{"$f":"IF(Miljö!H301=TRUE,  INDEX(Material!$A$146:$G$149, MATCH(Miljö!H303,Material!$A$146:$A$149, 0),4)*Miljö!H304+Trp!H157, 0)","v":0},{"$f":"IF(Miljö!I301=TRUE,  INDEX(Material!$A$146:$G$149, MATCH(Miljö!I303,Material!$A$146:$A$149, 0),4)*Miljö!I304+Trp!I157, 0)","v":0},{"$f":"IF(Miljö!J301=TRUE,  INDEX(Material!$A$146:$G$149, MATCH(Miljö!J303,Material!$A$146:$A$149, 0),4)*Miljö!J304+Trp!J157, 0)","v":0},{"$f":"IF(Miljö!K301=TRUE,  INDEX(Material!$A$146:$G$149, MATCH(Miljö!K303,Material!$A$146:$A$149, 0),4)*Miljö!K304+Trp!K157, 0)","v":0},{"$f":"IF(Miljö!L301=TRUE,  INDEX(Material!$A$146:$G$149, MATCH(Miljö!L303,Material!$A$146:$A$149, 0),4)*Miljö!L304+Trp!L157, 0)","v":0}]
["Materialanvändning+trp, kopparrör","kg CO2-eq",{"$f":"IF(Miljö!C311=TRUE,Miljö!C313*Material!$D$155+Trp!C158,0)","v":0},{"$f":"IF(Miljö!D311=TRUE,Miljö!D313*Material!$D$155+Trp!D158,0)","v":0},{"$f":"IF(Miljö!E311=TRUE,Miljö!E313*Material!$D$155+Trp!E158,0)","v":0},{"$f":"IF(Miljö!F311=TRUE,Miljö!F313*Material!$D$155+Trp!F158,0)","v":0},{"$f":"IF(Miljö!G311=TRUE,Miljö!G313*Material!$D$155+Trp!G158,0)","v":0},{"$f":"IF(Miljö!H311=TRUE,Miljö!H313*Material!$D$155+Trp!H158,0)","v":0},{"$f":"IF(Miljö!I311=TRUE,Miljö!I313*Material!$D$155+Trp!I158,0)","v":0},{"$f":"IF(Miljö!J311=TRUE,Miljö!J313*Material!$D$155+Trp!J158,0)","v":0},{"$f":"IF(Miljö!K311=TRUE,Miljö!K313*Material!$D$155+Trp!K158,0)","v":0},{"$f":"IF(Miljö!L311=TRUE,Miljö!L313*Material!$D$155+Trp!L158,0)","v":0}]
["Materialanvändning+trp, PEX-rör","kg CO2-eq",{"$f":"IF(Miljö!C320=TRUE,Miljö!C322*Material!$D$156+Trp!C159,0)","v":0},{"$f":"IF(Miljö!D320=TRUE,Miljö!D322*Material!$D$156+Trp!D159,0)","v":0},{"$f":"IF(Miljö!E320=TRUE,Miljö!E322*Material!$D$156+Trp!E159,0)","v":0},{"$f":"IF(Miljö!F320=TRUE,Miljö!F322*Material!$D$156+Trp!F159,0)","v":0},{"$f":"IF(Miljö!G320=TRUE,Miljö!G322*Material!$D$156+Trp!G159,0)","v":0},{"$f":"IF(Miljö!H320=TRUE,Miljö!H322*Material!$D$156+Trp!H159,0)","v":0},{"$f":"IF(Miljö!I320=TRUE,Miljö!I322*Material!$D$156+Trp!I159,0)","v":0},{"$f":"IF(Miljö!J320=TRUE,Miljö!J322*Material!$D$156+Trp!J159,0)","v":0},{"$f":"IF(Miljö!K320=TRUE,Miljö!K322*Material!$D$156+Trp!K159,0)","v":0},{"$f":"IF(Miljö!L320=TRUE,Miljö!L322*Material!$D$156+Trp!L159,0)","v":0}]
["Materialanvändning+trp, PP-rör","kg CO2-eq",{"$f":"IF(Miljö!C329=TRUE,Miljö!C331*Material!$D$157+Trp!C160,0)","v":0},{"$f":"IF(Miljö!D329=TRUE,Miljö!D331*Material!$D$157+Trp!D160,0)","v":0},{"$f":"IF(Miljö!E329=TRUE,Miljö!E331*Material!$D$157+Trp!E160,0)","v":0},{"$f":"IF(Miljö!F329=TRUE,Miljö!F331*Material!$D$157+Trp!F160,0)","v":0},{"$f":"IF(Miljö!G329=TRUE,Miljö!G331*Material!$D$157+Trp!G160,0)","v":0},{"$f":"IF(Miljö!H329=TRUE,Miljö!H331*Material!$D$157+Trp!H160,0)","v":0},{"$f":"IF(Miljö!I329=TRUE,Miljö!I331*Material!$D$157+Trp!I160,0)","v":0},{"$f":"IF(Miljö!J329=TRUE,Miljö!J331*Material!$D$157+Trp!J160,0)","v":0},{"$f":"IF(Miljö!K329=TRUE,Miljö!K331*Material!$D$157+Trp!K160,0)","v":0},{"$f":"IF(Miljö!L329=TRUE,Miljö!L331*Material!$D$157+Trp!L160,0)","v":0}]
["Materialanvändning+trp, järnrör","kg CO2-eq",{"$f":"IF(Miljö!C338=TRUE,Miljö!C340*Material!$D$158+Trp!C161,0)","v":0},{"$f":"IF(Miljö!D338=TRUE,Miljö!D340*Material!$D$158+Trp!D161,0)","v":0},{"$f":"IF(Miljö!E338=TRUE,Miljö!E340*Material!$D$158+Trp!E161,0)","v":0},{"$f":"IF(Miljö!F338=TRUE,Miljö!F340*Material!$D$158+Trp!F161,0)","v":0},{"$f":"IF(Miljö!G338=TRUE,Miljö!G340*Material!$D$158+Trp!G161,0)","v":0},{"$f":"IF(Miljö!H338=TRUE,Miljö!H340*Material!$D$158+Trp!H161,0)","v":0},{"$f":"IF(Miljö!I338=TRUE,Miljö!I340*Material!$D$158+Trp!I161,0)","v":0},{"$f":"IF(Miljö!J338=TRUE,Miljö!J340*Material!$D$158+Trp!J161,0)","v":0},{"$f":"IF(Miljö!K338=TRUE,Miljö!K340*Material!$D$158+Trp!K161,0)","v":0},{"$f":"IF(Miljö!L338=TRUE,Miljö!L340*Material!$D$158+Trp!L161,0)","v":0}]
["Materialanvändning+trp, stålrör","kg CO2-eq",{"$f":"IF(Miljö!C347=TRUE,Miljö!C349*Material!$D$159+Trp!C162,0)","v":0},{"$f":"IF(Miljö!D347=TRUE,Miljö!D349*Material!$D$159+Trp!D162,0)","v":0},{"$f":"IF(Miljö!E347=TRUE,Miljö!E349*Material!$D$159+Trp!E162,0)","v":0},{"$f":"IF(Miljö!F347=TRUE,Miljö!F349*Material!$D$159+Trp!F162,0)","v":0},{"$f":"IF(Miljö!G347=TRUE,Miljö!G349*Material!$D$159+Trp!G162,0)","v":0},{"$f":"IF(Miljö!H347=TRUE,Miljö!H349*Material!$D$159+Trp!H162,0)","v":0},{"$f":"IF(Miljö!I347=TRUE,Miljö!I349*Material!$D$159+Trp!I162,0)","v":0},{"$f":"IF(Miljö!J347=TRUE,Miljö!J349*Material!$D$159+Trp!J162,0)","v":0},{"$f":"IF(Miljö!K347=TRUE,Miljö!K349*Material!$D$159+Trp!K162,0)","v":0},{"$f":"IF(Miljö!L347=TRUE,Miljö!L349*Material!$D$159+Trp!L162,0)","v":0}]
["Materialanvändning+trp, relining rör","kg CO2-eq",{"$f":"IF(Miljö!C356=TRUE,Miljö!C358*Material!$D$165+Trp!C164,0)","v":0},{"$f":"IF(Miljö!D356=TRUE,Miljö!D358*Material!$D$165+Trp!D164,0)","v":0},{"$f":"IF(Miljö!E356=TRUE,Miljö!E358*Material!$D$165+Trp!E164,0)","v":0},{"$f":"IF(Miljö!F356=TRUE,Miljö!F358*Material!$D$165+Trp!F164,0)","v":0},{"$f":"IF(Miljö!G356=TRUE,Miljö!G358*Material!$D$165+Trp!G164,0)","v":0},{"$f":"IF(Miljö!H356=TRUE,Miljö!H358*Material!$D$165+Trp!H164,0)","v":0},{"$f":"IF(Miljö!I356=TRUE,Miljö!I358*Material!$D$165+Trp!I164,0)","v":0},{"$f":"IF(Miljö!J356=TRUE,Miljö!J358*Material!$D$165+Trp!J164,0)","v":0},{"$f":"IF(Miljö!K356=TRUE,Miljö!K358*Material!$D$165+Trp!K164,0)","v":0},{"$f":"IF(Miljö!L356=TRUE,Miljö!L358*Material!$D$165+Trp!L164,0)","v":0}]
["Materialanvändning+trp, elledning","kg CO2-eq",{"$f":"IF(Miljö!C384=TRUE,Miljö!C386*Material!$D$174+Trp!C165,0)","v":0},{"$f":"IF(Miljö!D384=TRUE,Miljö!D386*Material!$D$174+Trp!D165,0)","v":0},{"$f":"IF(Miljö!E384=TRUE,Miljö!E386*Material!$D$174+Trp!E165,0)","v":0},{"$f":"IF(Miljö!F384=TRUE,Miljö!F386*Material!$D$174+Trp!F165,0)","v":0},{"$f":"IF(Miljö!G384=TRUE,Miljö!G386*Material!$D$174+Trp!G165,0)","v":0},{"$f":"IF(Miljö!H384=TRUE,Miljö!H386*Material!$D$174+Trp!H165,0)","v":0},{"$f":"IF(Miljö!I384=TRUE,Miljö!I386*Material!$D$174+Trp!I165,0)","v":0},{"$f":"IF(Miljö!J384=TRUE,Miljö!J386*Material!$D$174+Trp!J165,0)","v":0},{"$f":"IF(Miljö!K384=TRUE,Miljö!K386*Material!$D$174+Trp!K165,0)","v":0},{"$f":"IF(Miljö!L384=TRUE,Miljö!L386*Material!$D$174+Trp!L165,0)","v":0}]
["Materialanvändning, Egen elproduktion","kg CO2-eq",{"$f":"IF(Miljö!C130=TRUE,INDEX(Material!$A$183:$G$186,MATCH(Miljö!C132,Material!$A$183:$A$186,0),4)*Miljö!C133+Trp!C146,0)","v":0},{"$f":"IF(Miljö!D130=TRUE,INDEX(Material!$A$183:$G$186,MATCH(Miljö!D132,Material!$A$183:$A$186,0),4)*Miljö!D133+Trp!D146,0)","v":0},{"$f":"IF(Miljö!E130=TRUE,INDEX(Material!$A$183:$G$186,MATCH(Miljö!E132,Material!$A$183:$A$186,0),4)*Miljö!E133+Trp!E146,0)","v":0},{"$f":"IF(Miljö!F130=TRUE,INDEX(Material!$A$183:$G$186,MATCH(Miljö!F132,Material!$A$183:$A$186,0),4)*Miljö!F133+Trp!F146,0)","v":0},{"$f":"IF(Miljö!G130=TRUE,INDEX(Material!$A$183:$G$186,MATCH(Miljö!G132,Material!$A$183:$A$186,0),4)*Miljö!G133+Trp!G146,0)","v":0},{"$f":"IF(Miljö!H130=TRUE,INDEX(Material!$A$183:$G$186,MATCH(Miljö!H132,Material!$A$183:$A$186,0),4)*Miljö!H133+Trp!H146,0)","v":0},{"$f":"IF(Miljö!I130=TRUE,INDEX(Material!$A$183:$G$186,MATCH(Miljö!I132,Material!$A$183:$A$186,0),4)*Miljö!I133+Trp!I146,0)","v":0},{"$f":"IF(Miljö!J130=TRUE,INDEX(Material!$A$183:$G$186,MATCH(Miljö!J132,Material!$A$183:$A$186,0),4)*Miljö!J133+Trp!J146,0)","v":0},{"$f":"IF(Miljö!K130=TRUE,INDEX(Material!$A$183:$G$186,MATCH(Miljö!K132,Material!$A$183:$A$186,0),4)*Miljö!K133+Trp!K146,0)","v":0},{"$f":"IF(Miljö!L130=TRUE,INDEX(Material!$A$183:$G$186,MATCH(Miljö!L132,Material!$A$183:$A$186,0),4)*Miljö!L133+Trp!L146,0)","v":0}]
["Total miljöpåverkan renovering","kg CO2-eq",{"$f":"SUM(C38:C67)","v":0},{"$f":"SUM(D38:D67)","v":0},0,0,0,0,0,0,0,0]
[]
["7.2.2 Årlig miljöpåverkan efter renovering","Negativa värden visar en miljöbesparing jämfört med referensfallet där ingen renovering görs"]
["Årlig miljöpåverkan, ändrat värmebehov","kg CO2-eq/år",{"$f":"INDEX(Uppvärmning!$A6:$I12, MATCH(Miljö!C93,Uppvärmning!$A6:$A12, 0),3)*Miljö!C144","v":{"$error":"#N/A"}},{"$f":"INDEX(Uppvärmning!$A6:$I12, MATCH(Miljö!D93,Uppvärmning!$A6:$A12, 0),3)*Miljö!D144","v":0},{"$f":"INDEX(Uppvärmning!$A6:$I12, MATCH(Miljö!E93,Uppvärmning!$A6:$A12, 0),3)*Miljö!E144","v":0},{"$f":"INDEX(Uppvärmning!$A6:$I12, MATCH(Miljö!F93,Uppvärmning!$A6:$A12, 0),3)*Miljö!F144","v":0},{"$f":"INDEX(Uppvärmning!$A6:$I12, MATCH(Miljö!G93,Uppvärmning!$A6:$A12, 0),3)*Miljö!G144","v":0},{"$f":"INDEX(Uppvärmning!$A6:$I12, MATCH(Miljö!H93,Uppvärmning!$A6:$A12, 0),3)*Miljö!H144","v":0},{"$f":"INDEX(Uppvärmning!$A6:$I12, MATCH(Miljö!I93,Uppvärmning!$A6:$A12, 0),3)*Miljö!I144","v":0},{"$f":"INDEX(Uppvärmning!$A6:$I12, MATCH(Miljö!J93,Uppvärmning!$A6:$A12, 0),3)*Miljö!J144","v":0},{"$f":"INDEX(Uppvärmning!$A6:$I12, MATCH(Miljö!K93,Uppvärmning!$A6:$A12, 0),3)*Miljö!K144","v":0},{"$f":"INDEX(Uppvärmning!$A6:$I12, MATCH(Miljö!L93,Uppvärmning!$A6:$A12, 0),3)*Miljö!L144","v":0}]
["Årlig miljöpåverkan, ändrat elbehov","kg CO2-eq/år",{"$f":"Uppvärmning!$C$11*Miljö!C145","v":0},{"$f":"Miljö!D145*Uppvärmning!$C$11","v":0},{"$f":"Miljö!E145*Uppvärmning!$C$11","v":0},{"$f":"Miljö!F145*Uppvärmning!$C$11","v":0},{"$f":"Miljö!G145*Uppvärmning!$C$11","v":0},{"$f":"Miljö!H145*Uppvärmning!$C$11","v":0},{"$f":"Miljö!I145*Uppvärmning!$C$11","v":0},{"$f":"Miljö!J145*Uppvärmning!$C$11","v":0},{"$f":"Miljö!K145*Uppvärmning!$C$11","v":0},{"$f":"Miljö!L145*Uppvärmning!$C$11","v":0}]
["Årlig miljöpåverkan, byte uppvärmning värmeprod","kg CO2-eq/år",{"$f":"IF(Miljö!C98=TRUE,Miljö!C95*Uppvärmning!D$58,0)","v":0},{"$f":"IF(Miljö!D98=TRUE,Miljö!D95*Uppvärmning!E$58,0)","v":0},{"$f":"IF(Miljö!E98=TRUE,Miljö!E95*Uppvärmning!F$58,0)","v":0},{"$f":"IF(Miljö!F98=TRUE,Miljö!F95*Uppvärmning!G$58,0)","v":0},{"$f":"IF(Miljö!G98=TRUE,Miljö!G95*Uppvärmning!H$58,0)","v":0},{"$f":"IF(Miljö!H98=TRUE,Miljö!H95*Uppvärmning!I$58,0)","v":0},{"$f":"IF(Miljö!I98=TRUE,Miljö!I95*Uppvärmning!J$58,0)","v":0},{"$f":"IF(Miljö!J98=TRUE,Miljö!J95*Uppvärmning!K$58,0)","v":0},{"$f":"IF(Miljö!K98=TRUE,Miljö!K95*Uppvärmning!L$58,0)","v":0},{"$f":"IF(Miljö!L98=TRUE,Miljö!L95*Uppvärmning!M$58,0)","v":0}]
["Årlig miljöpåverkan, Egen elproduktion","kg CO2-eq/år",{"$f":"-Uppvärmning!$C$11*Miljö!C134","v":0},{"$f":"-Uppvärmning!$C$11*Miljö!D134","v":0},{"$f":"-Uppvärmning!$C$11*Miljö!E134","v":0},{"$f":"-Uppvärmning!$C$11*Miljö!F134","v":0},{"$f":"-Uppvärmning!$C$11*Miljö!G134","v":0},{"$f":"-Uppvärmning!$C$11*Miljö!H134","v":0},{"$f":"-Uppvärmning!$C$11*Miljö!I134","v":0},{"$f":"-Uppvärmning!$C$11*Miljö!J134","v":0},{"$f":"-Uppvärmning!$C$11*Miljö!K134","v":0},{"$f":"-Uppvärmning!$C$11*Miljö!L134","v":0}]
["Total miljöpåverkan per år","kg CO2-eq/år",{"$f":"SUM(C71:C74)","v":{"$error":"#N/A"}},{"$f":"SUM(D71:D74)","v":0},0,0,0,0,0,0,0,0]
[]
["7.2.3 Miljöpåverkan avfallshantering","Negativa värden visar en miljöbesparing jämfört med referensfallet där ingen renovering görs"]
["Miljöpåverkan avfallshantering, isolering 1","kg CO2-eq",{"$f":"IF(Miljö!C151=TRUE,   INDEX(Material!$A$6:$G$9, MATCH(Miljö!C153,Material!$A6:$A9, 0),6)*Miljö!C154,  0)","v":0},{"$f":"IF(Miljö!D151=TRUE,   INDEX(Material!$A$6:$G$9, MATCH(Miljö!D153,Material!$A6:$A9, 0),6)*Miljö!D154,  0)","v":0},{"$f":"IF(Miljö!E151=TRUE,   INDEX(Material!$A$6:$G$9, MATCH(Miljö!E153,Material!$A6:$A9, 0),6)*Miljö!E154,  0)","v":0},{"$f":"IF(Miljö!F151=TRUE,   INDEX(Material!$A$6:$G$9, MATCH(Miljö!F153,Material!$A6:$A9, 0),6)*Miljö!F154,  0)","v":0},{"$f":"IF(Miljö!G151=TRUE,   INDEX(Material!$A$6:$G$9, MATCH(Miljö!G153,Material!$A6:$A9, 0),6)*Miljö!G154,  0)","v":0},{"$f":"IF(Miljö!H151=TRUE,   INDEX(Material!$A$6:$G$9, MATCH(Miljö!H153,Material!$A6:$A9, 0),6)*Miljö!H154,  0)","v":0},{"$f":"IF(Miljö!I151=TRUE,   INDEX(Material!$A$6:$G$9, MATCH(Miljö!I153,Material!$A6:$A9, 0),6)*Miljö!I154,  0)","v":0},{"$f":"IF(Miljö!J151=TRUE,   INDEX(Material!$A$6:$G$9, MATCH(Miljö!J153,Material!$A6:$A9, 0),6)*Miljö!J154,  0)","v":0},{"$f":"IF(Miljö!K151=TRUE,   INDEX(Material!$A$6:$G$9, MATCH(Miljö!K153,Material!$A6:$A9, 0),6)*Miljö!K154,  0)","v":0},{"$f":"IF(Miljö!L151=TRUE,   INDEX(Material!$A$6:$G$9, MATCH(Miljö!L153,Material!$A6:$A9, 0),6)*Miljö!L154,  0)","v":0}]
["Miljöpåverkan avfallshantering, isolering 2","kg CO2-eq",{"$f":"IF(Miljö!C161=TRUE,   INDEX(Material!$A$6:$G$9, MATCH(Miljö!C163,Material!$A6:$A9, 0),6)*Miljö!C164,  0)","v":0},{"$f":"IF(Miljö!D161=TRUE,   INDEX(Material!$A$6:$G$9, MATCH(Miljö!D163,Material!$A6:$A9, 0),6)*Miljö!D164,  0)","v":0},{"$f":"IF(Miljö!E161=TRUE,   INDEX(Material!$A$6:$G$9, MATCH(Miljö!E163,Material!$A6:$A9, 0),6)*Miljö!E164,  0)","v":0},{"$f":"IF(Miljö!F161=TRUE,   INDEX(Material!$A$6:$G$9, MATCH(Miljö!F163,Material!$A6:$A9, 0),6)*Miljö!F164,  0)","v":0},{"$f":"IF(Miljö!G161=TRUE,   INDEX(Material!$A$6:$G$9, MATCH(Miljö!G163,Material!$A6:$A9, 0),6)*Miljö!G164,  0)","v":0},{"$f":"IF(Miljö!H161=TRUE,   INDEX(Material!$A$6:$G$9, MATCH(Miljö!H163,Material!$A6:$A9, 0),6)*Miljö!H164,  0)","v":0},{"$f":"IF(Miljö!I161=TRUE,   INDEX(Material!$A$6:$G$9, MATCH(Miljö!I163,Material!$A6:$A9, 0),6)*Miljö!I164,  0)","v":0},{"$f":"IF(Miljö!J161=TRUE,   INDEX(Material!$A$6:$G$9, MATCH(Miljö!J163,Material!$A6:$A9, 0),6)*Miljö!J164,  0)","v":0},{"$f":"IF(Miljö!K161=TRUE,   INDEX(Material!$A$6:$G$9, MATCH(Miljö!K163,Material!$A6:$A9, 0),6)*Miljö!K164,  0)","v":0},{"$f":"IF(Miljö!L161=TRUE,   INDEX(Material!$A$6:$G$9, MATCH(Miljö!L163,Material!$A6:$A9, 0),6)*Miljö!L164,  0)","v":0}]
["Miljöpåverkan avfallshantering, fasadsystem","kg CO2-eq",{"$f":"IF(Miljö!C171=TRUE,  INDEX(Material!$A33:$G51, MATCH(Miljö!C173,Material!$A33:$A51, 0),6)*Miljö!C174,  0)","v":0},{"$f":"IF(Miljö!D171=TRUE,  INDEX(Material!$A33:$G51, MATCH(Miljö!D173,Material!$A33:$A51, 0),6)*Miljö!D174,  0)","v":0},{"$f":"IF(Miljö!E171=TRUE,  INDEX(Material!$A33:$G51, MATCH(Miljö!E173,Material!$A33:$A51, 0),6)*Miljö!E174,  0)","v":0},{"$f":"IF(Miljö!F171=TRUE,  INDEX(Material!$A33:$G51, MATCH(Miljö!F173,Material!$A33:$A51, 0),6)*Miljö!F174,  0)","v":0},{"$f":"IF(Miljö!G171=TRUE,  INDEX(Material!$A33:$G51, MATCH(Miljö!G173,Material!$A33:$A51, 0),6)*Miljö!G174,  0)","v":0},{"$f":"IF(Miljö!H171=TRUE,  INDEX(Material!$A33:$G51, MATCH(Miljö!H173,Material!$A33:$A51, 0),6)*Miljö!H174,  0)","v":0},{"$f":"IF(Miljö!I171=TRUE,  INDEX(Material!$A33:$G51, MATCH(Miljö!I173,Material!$A33:$A51, 0),6)*Miljö!I174,  0)","v":0},{"$f":"IF(Miljö!J171=TRUE,  INDEX(Material!$A33:$G51, MATCH(Miljö!J173,Material!$A33:$A51, 0),6)*Miljö!J174,  0)","v":0},{"$f":"IF(Miljö!K171=TRUE,  INDEX(Material!$A33:$G51, MATCH(Miljö!K173,Material!$A33:$A51, 0),6)*Miljö!K174,  0)","v":0},{"$f":"IF(Miljö!L171=TRUE,  INDEX(Material!$A33:$G51, MATCH(Miljö!L173,Material!$A33:$A51, 0),6)*Miljö!L174,  0)","v":0}]
["Miljöpåverkan avfallshantering, fönster","kg CO2-eq",{"$f":"IF(Miljö!C181=TRUE,  INDEX(Material!$A15:$G18, MATCH(Miljö!C183,Material!$A15:$A18, 0),6)*Miljö!C184,  0)","v":0},{"$f":"IF(Miljö!D181=TRUE,  INDEX(Material!$A15:$G18, MATCH(Miljö!D183,Material!$A15:$A18, 0),6)*Miljö!D184,  0)","v":0},{"$f":"IF(Miljö!E181=TRUE,  INDEX(Material!$A15:$G18, MATCH(Miljö!E183,Material!$A15:$A18, 0),6)*Miljö!E184,  0)","v":0},{"$f":"IF(Miljö!F181=TRUE,  INDEX(Material!$A15:$G18, MATCH(Miljö!F183,Material!$A15:$A18, 0),6)*Miljö!F184,  0)","v":0},{"$f":"IF(Miljö!G181=TRUE,  INDEX(Material!$A15:$G18, MATCH(Miljö!G183,Material!$A15:$A18, 0),6)*Miljö!G184,  0)","v":0},{"$f":"IF(Miljö!H181=TRUE,  INDEX(Material!$A15:$G18, MATCH(Miljö!H183,Material!$A15:$A18, 0),6)*Miljö!H184,  0)","v":0},{"$f":"IF(Miljö!I181=TRUE,  INDEX(Material!$A15:$G18, MATCH(Miljö!I183,Material!$A15:$A18, 0),6)*Miljö!I184,  0)","v":0},{"$f":"IF(Miljö!J181=TRUE,  INDEX(Material!$A15:$G18, MATCH(Miljö!J183,Material!$A15:$A18, 0),6)*Miljö!J184,  0)","v":0},{"$f":"IF(Miljö!K181=TRUE,  INDEX(Material!$A15:$G18, MATCH(Miljö!K183,Material!$A15:$A18, 0),6)*Miljö!K184,  0)","v":0},{"$f":"IF(Miljö!L181=TRUE,  INDEX(Material!$A15:$G18, MATCH(Miljö!L183,Material!$A15:$A18, 0),6)*Miljö!L184,  0)","v":0}]
["Miljöpåverkan avfallshantering, dörrar","kg CO2-eq",{"$f":"IF(Miljö!C191=TRUE,  INDEX(Material!$A24:$G27, MATCH(Miljö!C193,Material!$A15:$A18, 0),6)*Miljö!C194,  0)","v":0},{"$f":"IF(Miljö!D191=TRUE,  INDEX(Material!$A24:$G27, MATCH(Miljö!D193,Material!$A15:$A18, 0),6)*Miljö!D194,  0)","v":0},{"$f":"IF(Miljö!E191=TRUE,  INDEX(Material!$A24:$G27, MATCH(Miljö!E193,Material!$A15:$A18, 0),6)*Miljö!E194,  0)","v":0},{"$f":"IF(Miljö!F191=TRUE,  INDEX(Material!$A24:$G27, MATCH(Miljö!F193,Material!$A15:$A18, 0),6)*Miljö!F194,  0)","v":0},{"$f":"IF(Miljö!G191=TRUE,  INDEX(Material!$A24:$G27, MATCH(Miljö!G193,Material!$A15:$A18, 0),6)*Miljö!G194,  0)","v":0},{"$f":"IF(Miljö!H191=TRUE,  INDEX(Material!$A24:$G27, MATCH(Miljö!H193,Material!$A15:$A18, 0),6)*Miljö!H194,  0)","v":0},{"$f":"IF(Miljö!I191=TRUE,  INDEX(Material!$A24:$G27, MATCH(Miljö!I193,Material!$A15:$A18, 0),6)*Miljö!I194,  0)","v":0},{"$f":"IF(Miljö!J191=TRUE,  INDEX(Material!$A24:$G27, MATCH(Miljö!J193,Material!$A15:$A18, 0),6)*Miljö!J194,  0)","v":0},{"$f":"IF(Miljö!K191=TRUE,  INDEX(Material!$A24:$G27, MATCH(Miljö!K193,Material!$A15:$A18, 0),6)*Miljö!K194,  0)","v":0},{"$f":"IF(Miljö!L191=TRUE,  INDEX(Material!$A24:$G27, MATCH(Miljö!L193,Material!$A15:$A18, 0),6)*Miljö!L194,  0)","v":0}]
["Miljöpåverkan avfallshantering, byte uppvärmningsform","kg CO2-eq",{"$f":"IF(Miljö!C98=TRUE,INDEX(Uppvärmning!$A$66:$M$72, MATCH(Miljö!C94,Uppvärmning!$A$66:$A$72, 0),4),  0)","v":0},{"$f":"IF(Miljö!D98=TRUE,INDEX(Uppvärmning!$A$66:$M$72, MATCH(Miljö!D94,Uppvärmning!$A$66:$A$72, 0),5),  0)","v":0},{"$f":"IF(Miljö!E98=TRUE,INDEX(Uppvärmning!$A$66:$M$72, MATCH(Miljö!E94,Uppvärmning!$A$66:$A$72, 0),6),  0)","v":0},{"$f":"IF(Miljö!F98=TRUE,INDEX(Uppvärmning!$A$66:$M$72, MATCH(Miljö!F94,Uppvärmning!$A$66:$A$72, 0),7),  0)","v":0},{"$f":"IF(Miljö!G98=TRUE,INDEX(Uppvärmning!$A$66:$M$72, MATCH(Miljö!G94,Uppvärmning!$A$66:$A$72, 0),8),  0)","v":0},{"$f":"IF(Miljö!H98=TRUE,INDEX(Uppvärmning!$A$66:$M$72, MATCH(Miljö!H94,Uppvärmning!$A$66:$A$72, 0),9),  0)","v":0},{"$f":"IF(Miljö!I98=TRUE,INDEX(Uppvärmning!$A$66:$M$72, MATCH(Miljö!I94,Uppvärmning!$A$66:$A$72, 0),10),  0)","v":0},{"$f":"IF(Miljö!J98=TRUE,INDEX(Uppvärmning!$A$66:$M$72, MATCH(Miljö!J94,Uppvärmning!$A$66:$A$72, 0),11),  0)","v":0},{"$f":"IF(Miljö!K98=TRUE,INDEX(Uppvärmning!$A$66:$M$72, MATCH(Miljö!K94,Uppvärmning!$A$66:$A$72, 0),12),  0)","v":0},{"$f":"IF(Miljö!L98=TRUE,INDEX(Uppvärmning!$A$66:$M$72, MATCH(Miljö!L94,Uppvärmning!$A$66:$A$72, 0),13),  0)","v":0},"Avfallshantering av kringutrustning (t.ex. borrhål och oljetank) ej inkluderad"]
["Miljöpåverkan avfallshantering, cirkulationspump","kg CO2-eq",{"$f":"IF(Miljö!C111=TRUE,Miljö!C$113*Material!$F$138,  0)","v":0},{"$f":"IF(Miljö!D111=TRUE,Miljö!D$113*Material!$F$138,  0)","v":0},{"$f":"IF(Miljö!E111=TRUE,Miljö!E$113*Material!$F$138,  0)","v":0},{"$f":"IF(Miljö!F111=TRUE,Miljö!F$113*Material!$F$138,  0)","v":0},{"$f":"IF(Miljö!G111=TRUE,Miljö!G$113*Material!$F$138,  0)","v":0},{"$f":"IF(Miljö!H111=TRUE,Miljö!H$113*Material!$F$138,  0)","v":0},{"$f":"IF(Miljö!I111=TRUE,Miljö!I$113*Material!$F$138,  0)","v":0},{"$f":"IF(Miljö!J111=TRUE,Miljö!J$113*Material!$F$138,  0)","v":0},{"$f":"IF(Miljö!K111=TRUE,Miljö!K$113*Material!$F$138,  0)","v":0},{"$f":"IF(Miljö!L111=TRUE,Miljö!L$113*Material!$F$138,  0)","v":0}]
["Miljöpåverkan avfallshantering, ventilationskanaler","kg CO2-eq",{"$f":"IF(Miljö!C365=TRUE, INDEX(Material!$A110:$G113, MATCH(Miljö!C367,Material!$A110:$A113, 0),6)*Miljö!C368,0)","v":0},{"$f":"IF(Miljö!D365=TRUE, INDEX(Material!$A110:$G113, MATCH(Miljö!D367,Material!$A110:$A113, 0),6)*Miljö!D368,0)","v":0},{"$f":"IF(Miljö!E365=TRUE, INDEX(Material!$A110:$G113, MATCH(Miljö!E367,Material!$A110:$A113, 0),6)*Miljö!E368,0)","v":0},{"$f":"IF(Miljö!F365=TRUE, INDEX(Material!$A110:$G113, MATCH(Miljö!F367,Material!$A110:$A113, 0),6)*Miljö!F368,0)","v":0},{"$f":"IF(Miljö!G365=TRUE, INDEX(Material!$A110:$G113, MATCH(Miljö!G367,Material!$A110:$A113, 0),6)*Miljö!G368,0)","v":0},{"$f":"IF(Miljö!H365=TRUE, INDEX(Material!$A110:$G113, MATCH(Miljö!H367,Material!$A110:$A113, 0),6)*Miljö!H368,0)","v":0},{"$f":"IF(Miljö!I365=TRUE, INDEX(Material!$A110:$G113, MATCH(Miljö!I367,Material!$A110:$A113, 0),6)*Miljö!I368,0)","v":0},{"$f":"IF(Miljö!J365=TRUE, INDEX(Material!$A110:$G113, MATCH(Miljö!J367,Material!$A110:$A113, 0),6)*Miljö!J368,0)","v":0},{"$f":"IF(Miljö!K365=TRUE, INDEX(Material!$A110:$G113, MATCH(Miljö!K367,Material!$A110:$A113, 0),6)*Miljö!K368,0)","v":0},{"$f":"IF(Miljö!L365=TRUE, INDEX(Material!$A110:$G113, MATCH(Miljö!L367,Material!$A110:$A113, 0),6)*Miljö!L368,0)","v":0}]
["Miljöpåverkan avfallshantering, luftflödesaggregat","kg CO2-eq",{"$f":"IF(Miljö!C120=TRUE,INDEX(Material!$A119:$G122, MATCH(Miljö!C122,Material!$A119:$A122, 0),6)*Miljö!C123,0)","v":0},{"$f":"IF(Miljö!D120=TRUE,INDEX(Material!$A119:$G122, MATCH(Miljö!D122,Material!$A119:$A122, 0),6)*Miljö!D123,0)","v":0},{"$f":"IF(Miljö!E120=TRUE,INDEX(Material!$A119:$G122, MATCH(Miljö!E122,Material!$A119:$A122, 0),6)*Miljö!E123,0)","v":0},{"$f":"IF(Miljö!F120=TRUE,INDEX(Material!$A119:$G122, MATCH(Miljö!F122,Material!$A119:$A122, 0),6)*Miljö!F123,0)","v":0},{"$f":"IF(Miljö!G120=TRUE,INDEX(Material!$A119:$G122, MATCH(Miljö!G122,Material!$A119:$A122, 0),6)*Miljö!G123,0)","v":0},{"$f":"IF(Miljö!H120=TRUE,INDEX(Material!$A119:$G122, MATCH(Miljö!H122,Material!$A119:$A122, 0),6)*Miljö!H123,0)","v":0},{"$f":"IF(Miljö!I120=TRUE,INDEX(Material!$A119:$G122, MATCH(Miljö!I122,Material!$A119:$A122, 0),6)*Miljö!I123,0)","v":0},{"$f":"IF(Miljö!J120=TRUE,INDEX(Material!$A119:$G122, MATCH(Miljö!J122,Material!$A119:$A122, 0),6)*Miljö!J123,0)","v":0},{"$f":"IF(Miljö!K120=TRUE,INDEX(Material!$A119:$G122, MATCH(Miljö!K122,Material!$A119:$A122, 0),6)*Miljö!K123,0)","v":0},{"$f":"IF(Miljö!L120=TRUE,INDEX(Material!$A119:$G122, MATCH(Miljö!L122,Material!$A119:$A122, 0),6)*Miljö!L123,0)","v":0}]
["Miljöpåverkan avfallshantering, don och dämpare (vent)","kg CO2-eq",{"$f":"         IF(Miljö!C375=TRUE,Material!$F$128*Miljö!C377,0)","v":0},{"$f":"         IF(Miljö!D375=TRUE,Material!$F$128*Miljö!D377,0)","v":0},{"$f":"         IF(Miljö!E375=TRUE,Material!$F$128*Miljö!E377,0)","v":0},{"$f":"         IF(Miljö!F375=TRUE,Material!$F$128*Miljö!F377,0)","v":0},{"$f":"         IF(Miljö!G375=TRUE,Material!$F$128*Miljö!G377,0)","v":0},{"$f":"         IF(Miljö!H375=TRUE,Material!$F$128*Miljö!H377,0)","v":0},{"$f":"         IF(Miljö!I375=TRUE,Material!$F$128*Miljö!I377,0)","v":0},{"$f":"         IF(Miljö!J375=TRUE,Material!$F$128*Miljö!J377,0)","v":0},{"$f":"         IF(Miljö!K375=TRUE,Material!$F$128*Miljö!K377,0)","v":0},{"$f":"         IF(Miljö!L375=TRUE,Material!$F$128*Miljö!L377,0)","v":0}]
["Trä konstruktionsvirke","kg CO2-eq",{"$f":"IF(Miljö!C$204=TRUE,Material!$F$57*Miljö!C$206,0)","v":0},{"$f":"IF(Miljö!D$204=TRUE,Material!$F$57*Miljö!D$206,0)","v":0},{"$f":"IF(Miljö!E$204=TRUE,Material!$F$57*Miljö!E$206,0)","v":0},{"$f":"IF(Miljö!F$204=TRUE,Material!$F$57*Miljö!F$206,0)","v":0},{"$f":"IF(Miljö!G$204=TRUE,Material!$F$57*Miljö!G$206,0)","v":0},{"$f":"IF(Miljö!H$204=TRUE,Material!$F$57*Miljö!H$206,0)","v":0},{"$f":"IF(Miljö!I$204=TRUE,Material!$F$57*Miljö!I$206,0)","v":0},{"$f":"IF(Miljö!J$204=TRUE,Material!$F$57*Miljö!J$206,0)","v":0},{"$f":"IF(Miljö!K$204=TRUE,Material!$F$57*Miljö!K$206,0)","v":0},{"$f":"IF(Miljö!L$204=TRUE,Material!$F$57*Miljö!L$206,0)","v":0}]
["Trä målad träfasad","kg CO2-eq",{"$f":"IF(Miljö!C$213=TRUE,Material!$F$58*Miljö!C$215,0)","v":0},{"$f":"IF(Miljö!D$213=TRUE,Material!$F$58*Miljö!D$215,0)","v":0},{"$f":"IF(Miljö!E$213=TRUE,Material!$F$58*Miljö!E$215,0)","v":0},{"$f":"IF(Miljö!F$213=TRUE,Material!$F$58*Miljö!F$215,0)","v":0},{"$f":"IF(Miljö!G$213=TRUE,Material!$F$58*Miljö!G$215,0)","v":0},{"$f":"IF(Miljö!H$213=TRUE,Material!$F$58*Miljö!H$215,0)","v":0},{"$f":"IF(Miljö!I$213=TRUE,Material!$F$58*Miljö!I$215,0)","v":0},{"$f":"IF(Miljö!J$213=TRUE,Material!$F$58*Miljö!J$215,0)","v":0},{"$f":"IF(Miljö!K$213=TRUE,Material!$F$58*Miljö!K$215,0)","v":0},{"$f":"IF(Miljö!L$213=TRUE,Material!$F$58*Miljö!L$215,0)","v":0}]
["Trä invändig träpanel","kg CO2-eq",{"$f":"IF(Miljö!C$222=TRUE,Material!$F$59*Miljö!C$224,0)","v":0},{"$f":"IF(Miljö!D$222=TRUE,Material!$F$59*Miljö!D$224,0)","v":0},{"$f":"IF(Miljö!E$222=TRUE,Material!$F$59*Miljö!E$224,0)","v":0},{"$f":"IF(Miljö!F$222=TRUE,Material!$F$59*Miljö!F$224,0)","v":0},{"$f":"IF(Miljö!G$222=TRUE,Material!$F$59*Miljö!G$224,0)","v":0},{"$f":"IF(Miljö!H$222=TRUE,Material!$F$59*Miljö!H$224,0)","v":0},{"$f":"IF(Miljö!I$222=TRUE,Material!$F$59*Miljö!I$224,0)","v":0},{"$f":"IF(Miljö!J$222=TRUE,Material!$F$59*Miljö!J$224,0)","v":0},{"$f":"IF(Miljö!K$222=TRUE,Material!$F$59*Miljö!K$224,0)","v":0},{"$f":"IF(Miljö!L$222=TRUE,Material!$F$59*Miljö!L$224,0)","v":0}]
["Betong bjälklag","kg CO2-eq",{"$f":"IF(Miljö!C$231=TRUE,INDEX(Material!$A$65:$G$67,MATCH(Miljö!C$233,Material!$A$65:$A$67,0),6)*Miljö!C$234,0)","v":0},{"$f":"IF(Miljö!D$231=TRUE,INDEX(Material!$A$65:$G$67,MATCH(Miljö!D$233,Material!$A$65:$A$67,0),6)*Miljö!D$234,0)","v":0},{"$f":"IF(Miljö!E$231=TRUE,INDEX(Material!$A$65:$G$67,MATCH(Miljö!E$233,Material!$A$65:$A$67,0),6)*Miljö!E$234,0)","v":0},{"$f":"IF(Miljö!F$231=TRUE,INDEX(Material!$A$65:$G$67,MATCH(Miljö!F$233,Material!$A$65:$A$67,0),6)*Miljö!F$234,0)","v":0},{"$f":"IF(Miljö!G$231=TRUE,INDEX(Material!$A$65:$G$67,MATCH(Miljö!G$233,Material!$A$65:$A$67,0),6)*Miljö!G$234,0)","v":0},{"$f":"IF(Miljö!H$231=TRUE,INDEX(Material!$A$65:$G$67,MATCH(Miljö!H$233,Material!$A$65:$A$67,0),6)*Miljö!H$234,0)","v":0},{"$f":"IF(Miljö!I$231=TRUE,INDEX(Material!$A$65:$G$67,MATCH(Miljö!I$233,Material!$A$65:$A$67,0),6)*Miljö!I$234,0)","v":0},{"$f":"IF(Miljö!J$231=TRUE,INDEX(Material!$A$65:$G$67,MATCH(Miljö!J$233,Material!$A$65:$A$67,0),6)*Miljö!J$234,0)","v":0},{"$f":"IF(Miljö!K$231=TRUE,INDEX(Material!$A$65:$G$67,MATCH(Miljö!K$233,Material!$A$65:$A$67,0),6)*Miljö!K$234,0)","v":0},{"$f":"IF(Miljö!L$231=TRUE,INDEX(Material!$A$65:$G$67,MATCH(Miljö!L$233,Material!$A$65:$A$67,0),6)*Miljö!L$234,0)","v":0}]
["Betong bärande ytterväggar","kg CO2-eq",{"$f":"IF(Miljö!C$241=TRUE,INDEX(Material!$A$74:$G$75,MATCH(Miljö!C$243,Material!$A$74:$A$75,0),6)*Miljö!C$244,0)","v":0},{"$f":"IF(Miljö!D$241=TRUE,INDEX(Material!$A$74:$G$75,MATCH(Miljö!D$243,Material!$A$74:$A$75,0),6)*Miljö!D$244,0)","v":0},{"$f":"IF(Miljö!E$241=TRUE,INDEX(Material!$A$74:$G$75,MATCH(Miljö!E$243,Material!$A$74:$A$75,0),6)*Miljö!E$244,0)","v":0},{"$f":"IF(Miljö!F$241=TRUE,INDEX(Material!$A$74:$G$75,MATCH(Miljö!F$243,Material!$A$74:$A$75,0),6)*Miljö!F$244,0)","v":0},{"$f":"IF(Miljö!G$241=TRUE,INDEX(Material!$A$74:$G$75,MATCH(Miljö!G$243,Material!$A$74:$A$75,0),6)*Miljö!G$244,0)","v":0},{"$f":"IF(Miljö!H$241=TRUE,INDEX(Material!$A$74:$G$75,MATCH(Miljö!H$243,Material!$A$74:$A$75,0),6)*Miljö!H$244,0)","v":0},{"$f":"IF(Miljö!I$241=TRUE,INDEX(Material!$A$74:$G$75,MATCH(Miljö!I$243,Material!$A$74:$A$75,0),6)*Miljö!I$244,0)","v":0},{"$f":"IF(Miljö!J$241=TRUE,INDEX(Material!$A$74:$G$75,MATCH(Miljö!J$243,Material!$A$74:$A$75,0),6)*Miljö!J$244,0)","v":0},{"$f":"IF(Miljö!K$241=TRUE,INDEX(Material!$A$74:$G$75,MATCH(Miljö!K$243,Material!$A$74:$A$75,0),6)*Miljö!K$244,0)","v":0},{"$f":"IF(Miljö!L$241=TRUE,INDEX(Material!$A$74:$G$75,MATCH(Miljö!L$243,Material!$A$74:$A$75,0),6)*Miljö!L$244,0)","v":0}]
["Betong icke-bärande ytterväggar","kg CO2-eq",{"$f":"IF(Miljö!C$251=TRUE,Material!$F$77*Miljö!C$253,0)","v":0},{"$f":"IF(Miljö!D$251=TRUE,Material!$F$77*Miljö!D$253,0)","v":0},{"$f":"IF(Miljö!E$251=TRUE,Material!$F$77*Miljö!E$253,0)","v":0},{"$f":"IF(Miljö!F$251=TRUE,Material!$F$77*Miljö!F$253,0)","v":0},{"$f":"IF(Miljö!G$251=TRUE,Material!$F$77*Miljö!G$253,0)","v":0},{"$f":"IF(Miljö!H$251=TRUE,Material!$F$77*Miljö!H$253,0)","v":0},{"$f":"IF(Miljö!I$251=TRUE,Material!$F$77*Miljö!I$253,0)","v":0},{"$f":"IF(Miljö!J$251=TRUE,Material!$F$77*Miljö!J$253,0)","v":0},{"$f":"IF(Miljö!K$251=TRUE,Material!$F$77*Miljö!K$253,0)","v":0},{"$f":"IF(Miljö!L$251=TRUE,Material!$F$77*Miljö!L$253,0)","v":0}]
["Betong innerväggar","kg CO2-eq",{"$f":"IF(Miljö!C$260=TRUE,INDEX(Material!$A$84:$G$85,MATCH(Miljö!C$262,Material!$A$84:$A$85,0),6)*Miljö!C$263,0)","v":0},{"$f":"IF(Miljö!D$260=TRUE,INDEX(Material!$A$84:$G$85,MATCH(Miljö!D$262,Material!$A$84:$A$85,0),6)*Miljö!D$263,0)","v":0},{"$f":"IF(Miljö!E$260=TRUE,INDEX(Material!$A$84:$G$85,MATCH(Miljö!E$262,Material!$A$84:$A$85,0),6)*Miljö!E$263,0)","v":0},{"$f":"IF(Miljö!F$260=TRUE,INDEX(Material!$A$84:$G$85,MATCH(Miljö!F$262,Material!$A$84:$A$85,0),6)*Miljö!F$263,0)","v":0},{"$f":"IF(Miljö!G$260=TRUE,INDEX(Material!$A$84:$G$85,MATCH(Miljö!G$262,Material!$A$84:$A$85,0),6)*Miljö!G$263,0)","v":0},{"$f":"IF(Miljö!H$260=TRUE,INDEX(Material!$A$84:$G$85,MATCH(Miljö!H$262,Material!$A$84:$A$85,0),6)*Miljö!H$263,0)","v":0},{"$f":"IF(Miljö!I$260=TRUE,INDEX(Material!$A$84:$G$85,MATCH(Miljö!I$262,Material!$A$84:$A$85,0),6)*Miljö!I$263,0)","v":0},{"$f":"IF(Miljö!J$260=TRUE,INDEX(Material!$A$84:$G$85,MATCH(Miljö!J$262,Material!$A$84:$A$85,0),6)*Miljö!J$263,0)","v":0},{"$f":"IF(Miljö!K$260=TRUE,INDEX(Material!$A$84:$G$85,MATCH(Miljö!K$262,Material!$A$84:$A$85,0),6)*Miljö!K$263,0)","v":0},{"$f":"IF(Miljö!L$260=TRUE,INDEX(Material!$A$84:$G$85,MATCH(Miljö!L$262,Material!$A$84:$A$85,0),6)*Miljö!L$263,0)","v":0}]
["Puts","kg CO2-eq",{"$f":"IF(Miljö!C$270=TRUE,Material!$F$90*Miljö!C$272,0)","v":0},{"$f":"IF(Miljö!D$270=TRUE,Material!$F$90*Miljö!D$272,0)","v":0},{"$f":"IF(Miljö!E$270=TRUE,Material!$F$90*Miljö!E$272,0)","v":0},{"$f":"IF(Miljö!F$270=TRUE,Material!$F$90*Miljö!F$272,0)","v":0},{"$f":"IF(Miljö!G$270=TRUE,Material!$F$90*Miljö!G$272,0)","v":0},{"$f":"IF(Miljö!H$270=TRUE,Material!$F$90*Miljö!H$272,0)","v":0},{"$f":"IF(Miljö!I$270=TRUE,Material!$F$90*Miljö!I$272,0)","v":0},{"$f":"IF(Miljö!J$270=TRUE,Material!$F$90*Miljö!J$272,0)","v":0},{"$f":"IF(Miljö!K$270=TRUE,Material!$F$90*Miljö!K$272,0)","v":0},{"$f":"IF(Miljö!L$270=TRUE,Material!$F$90*Miljö!L$272,0)","v":0}]
["Gipsskivor","kg CO2-eq",{"$f":"IF(Miljö!C$279=TRUE,Material!$F$91*Miljö!C$281,0)","v":0},{"$f":"IF(Miljö!D$279=TRUE,Material!$F$91*Miljö!D$281,0)","v":0},{"$f":"IF(Miljö!E$279=TRUE,Material!$F$91*Miljö!E$281,0)","v":0},{"$f":"IF(Miljö!F$279=TRUE,Material!$F$91*Miljö!F$281,0)","v":0},{"$f":"IF(Miljö!G$279=TRUE,Material!$F$91*Miljö!G$281,0)","v":0},{"$f":"IF(Miljö!H$279=TRUE,Material!$F$91*Miljö!H$281,0)","v":0},{"$f":"IF(Miljö!I$279=TRUE,Material!$F$91*Miljö!I$281,0)","v":0},{"$f":"IF(Miljö!J$279=TRUE,Material!$F$91*Miljö!J$281,0)","v":0},{"$f":"IF(Miljö!K$279=TRUE,Material!$F$91*Miljö!K$281,0)","v":0},{"$f":"IF(Miljö!L$279=TRUE,Material!$F$91*Miljö!L$281,0)","v":0}]
["Takbeläggning","kg CO2-eq",{"$f":"IF(Miljö!C$288=TRUE,INDEX(Material!$A$98:$G$102,MATCH(Miljö!C$290,Material!$A$98:$A$102,0),6)*Miljö!C$291,0)","v":0},{"$f":"IF(Miljö!D$288=TRUE,INDEX(Material!$A$98:$G$102,MATCH(Miljö!D$290,Material!$A$98:$A$102,0),6)*Miljö!D$291,0)","v":0},{"$f":"IF(Miljö!E$288=TRUE,INDEX(Material!$A$98:$G$102,MATCH(Miljö!E$290,Material!$A$98:$A$102,0),6)*Miljö!E$291,0)","v":0},{"$f":"IF(Miljö!F$288=TRUE,INDEX(Material!$A$98:$G$102,MATCH(Miljö!F$290,Material!$A$98:$A$102,0),6)*Miljö!F$291,0)","v":0},{"$f":"IF(Miljö!G$288=TRUE,INDEX(Material!$A$98:$G$102,MATCH(Miljö!G$290,Material!$A$98:$A$102,0),6)*Miljö!G$291,0)","v":0},{"$f":"IF(Miljö!H$288=TRUE,INDEX(Material!$A$98:$G$102,MATCH(Miljö!H$290,Material!$A$98:$A$102,0),6)*Miljö!H$291,0)","v":0},{"$f":"IF(Miljö!I$288=TRUE,INDEX(Material!$A$98:$G$102,MATCH(Miljö!I$290,Material!$A$98:$A$102,0),6)*Miljö!I$291,0)","v":0},{"$f":"IF(Miljö!J$288=TRUE,INDEX(Material!$A$98:$G$102,MATCH(Miljö!J$290,Material!$A$98:$A$102,0),6)*Miljö!J$291,0)","v":0},{"$f":"IF(Miljö!K$288=TRUE,INDEX(Material!$A$98:$G$102,MATCH(Miljö!K$290,Material!$A$98:$A$102,0),6)*Miljö!K$291,0)","v":0},{"$f":"IF(Miljö!L$288=TRUE,INDEX(Material!$A$98:$G$102,MATCH(Miljö!L$290,Material!$A$98:$A$102,0),6)*Miljö!L$291,0)","v":0}]
["Miljöpåverkan avfallshantering, radiatorer","kg CO2-eq",{"$f":"IF(Miljö!C301=TRUE,   INDEX(Material!$A$146:$G$149, MATCH(Miljö!C303,Material!$A$146:$A$149, 0),6)*Miljö!C304, 0)","v":0},{"$f":"IF(Miljö!D301=TRUE,   INDEX(Material!$A$146:$G$149, MATCH(Miljö!D303,Material!$A$146:$A$149, 0),6)*Miljö!D304, 0)","v":0},{"$f":"IF(Miljö!E301=TRUE,   INDEX(Material!$A$146:$G$149, MATCH(Miljö!E303,Material!$A$146:$A$149, 0),6)*Miljö!E304, 0)","v":0},{"$f":"IF(Miljö!F301=TRUE,   INDEX(Material!$A$146:$G$149, MATCH(Miljö!F303,Material!$A$146:$A$149, 0),6)*Miljö!F304, 0)","v":0},{"$f":"IF(Miljö!G301=TRUE,   INDEX(Material!$A$146:$G$149, MATCH(Miljö!G303,Material!$A$146:$A$149, 0),6)*Miljö!G304, 0)","v":0},{"$f":"IF(Miljö!H301=TRUE,   INDEX(Material!$A$146:$G$149, MATCH(Miljö!H303,Material!$A$146:$A$149, 0),6)*Miljö!H304, 0)","v":0},{"$f":"IF(Miljö!I301=TRUE,   INDEX(Material!$A$146:$G$149, MATCH(Miljö!I303,Material!$A$146:$A$149, 0),6)*Miljö!I304, 0)","v":0},{"$f":"IF(Miljö!J301=TRUE,   INDEX(Material!$A$146:$G$149, MATCH(Miljö!J303,Material!$A$146:$A$149, 0),6)*Miljö!J304, 0)","v":0},{"$f":"IF(Miljö!K301=TRUE,   INDEX(Material!$A$146:$G$149, MATCH(Miljö!K303,Material!$A$146:$A$149, 0),6)*Miljö!K304, 0)","v":0},{"$f":"IF(Miljö!L301=TRUE,   INDEX(Material!$A$146:$G$149, MATCH(Miljö!L303,Material!$A$146:$A$149, 0),6)*Miljö!L304, 0)","v":0}]
["Miljöpåverkan avfallshantering, kopparrör","kg CO2-eq",{"$f":"IF(Miljö!C311=TRUE,Miljö!C313*Material!$F$155,0)","v":0},{"$f":"IF(Miljö!D311=TRUE,Miljö!D313*Material!$F$155,0)","v":0},{"$f":"IF(Miljö!E311=TRUE,Miljö!E313*Material!$F$155,0)","v":0},{"$f":"IF(Miljö!F311=TRUE,Miljö!F313*Material!$F$155,0)","v":0},{"$f":"IF(Miljö!G311=TRUE,Miljö!G313*Material!$F$155,0)","v":0},{"$f":"IF(Miljö!H311=TRUE,Miljö!H313*Material!$F$155,0)","v":0},{"$f":"IF(Miljö!I311=TRUE,Miljö!I313*Material!$F$155,0)","v":0},{"$f":"IF(Miljö!J311=TRUE,Miljö!J313*Material!$F$155,0)","v":0},{"$f":"IF(Miljö!K311=TRUE,Miljö!K313*Material!$F$155,0)","v":0},{"$f":"IF(Miljö!L311=TRUE,Miljö!L313*Material!$F$155,0)","v":0}]
["Miljöpåverkan avfallshantering, PEX-rör","kg CO2-eq",{"$f":"IF(Miljö!C320=TRUE,Miljö!C322*Material!$F$156,0)","v":0},{"$f":"IF(Miljö!D320=TRUE,Miljö!D322*Material!$F$156,0)","v":0},{"$f":"IF(Miljö!E320=TRUE,Miljö!E322*Material!$F$156,0)","v":0},{"$f":"IF(Miljö!F320=TRUE,Miljö!F322*Material!$F$156,0)","v":0},{"$f":"IF(Miljö!G320=TRUE,Miljö!G322*Material!$F$156,0)","v":0},{"$f":"IF(Miljö!H320=TRUE,Miljö!H322*Material!$F$156,0)","v":0},{"$f":"IF(Miljö!I320=TRUE,Miljö!I322*Material!$F$156,0)","v":0},{"$f":"IF(Miljö!J320=TRUE,Miljö!J322*Material!$F$156,0)","v":0},{"$f":"IF(Miljö!K320=TRUE,Miljö!K322*Material!$F$156,0)","v":0},{"$f":"IF(Miljö!L320=TRUE,Miljö!L322*Material!$F$156,0)","v":0}]
["Miljöpåverkan avfallshantering, PP-rör","kg CO2-eq",{"$f":"IF(Miljö!C329=TRUE,Miljö!C331*Material!$F$157,0)","v":0},{"$f":"IF(Miljö!D329=TRUE,Miljö!D331*Material!$F$157,0)","v":0},{"$f":"IF(Miljö!E329=TRUE,Miljö!E331*Material!$F$157,0)","v":0},{"$f":"IF(Miljö!F329=TRUE,Miljö!F331*Material!$F$157,0)","v":0},{"$f":"IF(Miljö!G329=TRUE,Miljö!G331*Material!$F$157,0)","v":0},{"$f":"IF(Miljö!H329=TRUE,Miljö!H331*Material!$F$157,0)","v":0},{"$f":"IF(Miljö!I329=TRUE,Miljö!I331*Material!$F$157,0)","v":0},{"$f":"IF(Miljö!J329=TRUE,Miljö!J331*Material!$F$157,0)","v":0},{"$f":"IF(Miljö!K329=TRUE,Miljö!K331*Material!$F$157,0)","v":0},{"$f":"IF(Miljö!L329=TRUE,Miljö!L331*Material!$F$157,0)","v":0}]
["Miljöpåverkan avfallshantering, järnrör","kg CO2-eq",{"$f":"IF(Miljö!C338=TRUE,Miljö!C340*Material!$F$158,0)","v":0},{"$f":"IF(Miljö!D338=TRUE,Miljö!D340*Material!$F$158,0)","v":0},{"$f":"IF(Miljö!E338=TRUE,Miljö!E340*Material!$F$158,0)","v":0},{"$f":"IF(Miljö!F338=TRUE,Miljö!F340*Material!$F$158,0)","v":0},{"$f":"IF(Miljö!G338=TRUE,Miljö!G340*Material!$F$158,0)","v":0},{"$f":"IF(Miljö!H338=TRUE,Miljö!H340*Material!$F$158,0)","v":0},{"$f":"IF(Miljö!I338=TRUE,Miljö!I340*Material!$F$158,0)","v":0},{"$f":"IF(Miljö!J338=TRUE,Miljö!J340*Material!$F$158,0)","v":0},{"$f":"IF(Miljö!K338=TRUE,Miljö!K340*Material!$F$158,0)","v":0},{"$f":"IF(Miljö!L338=TRUE,Miljö!L340*Material!$F$158,0)","v":0}]
["Miljöpåverkan avfallshantering, stålrör","kg CO2-eq",{"$f":"IF(Miljö!C347=TRUE,Miljö!C349*Material!$F$159,0)","v":0},{"$f":"IF(Miljö!D347=TRUE,Miljö!D349*Material!$F$159,0)","v":0},{"$f":"IF(Miljö!E347=TRUE,Miljö!E349*Material!$F$159,0)","v":0},{"$f":"IF(Miljö!F347=TRUE,Miljö!F349*Material!$F$159,0)","v":0},{"$f":"IF(Miljö!G347=TRUE,Miljö!G349*Material!$F$159,0)","v":0},{"$f":"IF(Miljö!H347=TRUE,Miljö!H349*Material!$F$159,0)","v":0},{"$f":"IF(Miljö!I347=TRUE,Miljö!I349*Material!$F$159,0)","v":0},{"$f":"IF(Miljö!J347=TRUE,Miljö!J349*Material!$F$159,0)","v":0},{"$f":"IF(Miljö!K347=TRUE,Miljö!K349*Material!$F$159,0)","v":0},{"$f":"IF(Miljö!L347=TRUE,Miljö!L349*Material!$F$159,0)","v":0}]
["Miljöpåverkan avfallshantering, relining rör","kg CO2-eq",{"$f":"IF(Miljö!C356=TRUE,Miljö!C358*Material!$F$165,0)","v":0},{"$f":"IF(Miljö!D356=TRUE,Miljö!D358*Material!$F$165,0)","v":0},{"$f":"IF(Miljö!E356=TRUE,Miljö!E358*Material!$F$165,0)","v":0},{"$f":"IF(Miljö!F356=TRUE,Miljö!F358*Material!$F$165,0)","v":0},{"$f":"IF(Miljö!G356=TRUE,Miljö!G358*Material!$F$165,0)","v":0},{"$f":"IF(Miljö!H356=TRUE,Miljö!H358*Material!$F$165,0)","v":0},{"$f":"IF(Miljö!I356=TRUE,Miljö!I358*Material!$F$165,0)","v":0},{"$f":"IF(Miljö!J356=TRUE,Miljö!J358*Material!$F$165,0)","v":0},{"$f":"IF(Miljö!K356=TRUE,Miljö!K358*Material!$F$165,0)","v":0},{"$f":"IF(Miljö!L356=TRUE,Miljö!L358*Material!$F$165,0)","v":0}]
["Miljöpåverkan avfallshantering, elledning","kg CO2-eq",{"$f":"IF(Miljö!C384=TRUE,Miljö!C386*Material!$F$174,0)","v":0},{"$f":"IF(Miljö!D384=TRUE,Miljö!D386*Material!$F$174,0)","v":0},{"$f":"IF(Miljö!E384=TRUE,Miljö!E386*Material!$F$174,0)","v":0},{"$f":"IF(Miljö!F384=TRUE,Miljö!F386*Material!$F$174,0)","v":0},{"$f":"IF(Miljö!G384=TRUE,Miljö!G386*Material!$F$174,0)","v":0},{"$f":"IF(Miljö!H384=TRUE,Miljö!H386*Material!$F$174,0)","v":0},{"$f":"IF(Miljö!I384=TRUE,Miljö!I386*Material!$F$174,0)","v":0},{"$f":"IF(Miljö!J384=TRUE,Miljö!J386*Material!$F$174,0)","v":0},{"$f":"IF(Miljö!K384=TRUE,Miljö!K386*Material!$F$174,0)","v":0},{"$f":"IF(Miljö!L384=TRUE,Miljö!L386*Material!$F$174,0)","v":0}]
["Miljöpåverkan avfallshantering, Egen elproduktion","kg CO2-eq",0,0,0,0,0,0,0,0,0,0,"inkl i tillverkningsdata"]
["Total miljöpåverkan avfallshantering","kg CO2-eq",{"$f":"SUM(C78:C106)","v":0},{"$f":"SUM(D78:D106)","v":0},0,0,0,0,0,0,0,{"$f":"SUM(L78:L106)","v":0}]
[]
[]
["7.2.4 Total miljöpåverkan under tidsperioden","Negativa värden visar en miljöbesparing jämfört med referensfallet där ingen renovering görs"]
["Total miljöpåverkan, isolering 1","kg CO2-eq",{"$f":"C38*C5+C78*C5","v":0},0,0,0,0,0,0,0,0,0]
["Total miljöpåverkan, isolering 2","kg CO2-eq",0,0,0,0,0,0,0,0,0,0]
["Total miljöpåverkan, fasadsystem","kg CO2-eq",0,0,0,0,0,0,0,0,0,0]
["Total miljöpåverkan, fönster","kg CO2-eq",0,0,0,0,0,0,0,0,0,0]
["Total miljöpåverkan, dörrar","kg CO2-eq",0,0,0,0,0,0,0,0,0,0]
["Total miljöpåverkan, byte uppvärmningsform (material)","kg CO2-eq",{"$f":" C43*C10+C83*C10+C44*C11","v":0},0,0,0,0,0,0,0,0,0]
["Total miljöpåverkan, cirkulationspump","kg CO2-eq",{"$f":"C45*C12+C84*C12","v":0},0,0,0,0,0,0,0,0,0]
["Total miljöpåverkan, ventilation (material)","kg CO2-eq",{"$f":"C46*C13+C85*C13    +C47*C14+C86*C14    +C48*C15+C87*C15","v":0},0,0,0,0,0,0,0,0,0]
["Trä konstruktionsvirke","kg CO2-eq",{"$f":"C49*C16+C88*C16","v":0},{"$f":"D49*D16+D88*D16","v":0},0,0,0,0,0,0,0,0]
["Trä målad träfasad","kg CO2-eq",{"$f":"C50*C17+C89*C17","v":0},0,0,0,0,0,0,0,0,0]
["Trä invändig träpanel","kg CO2-eq",0,0,0,0,0,0,0,0,0,0]
["Betong bjälklag","kg CO2-eq",0,0,0,0,0,0,0,0,0,0]
["Betong bärande ytterväggar","kg CO2-eq",0,0,0,0,0,0,0,0,0,0]
["Betong icke-bärande ytterväggar","kg CO2-eq",0,0,0,0,0,0,0,0,0,0]
["Betong innerväggar","kg CO2-eq",0,0,0,0,0,0,0,0,0,0]
["Puts","kg CO2-eq",0,0,0,0,0,0,0,0,0,0]
["Gipsskivor","kg CO2-eq",0,0,0,0,0,0,0,0,0,0]
["Takbeläggning","kg CO2-eq",{"$f":"C58*C25+C97*C25","v":0},0,0,0,0,0,0,0,0,0]
["Total miljöpåverkan, radiatorer","kg CO2-eq",{"$f":"C59*C26+C98*C26","v":0},0,0,0,0,0,0,0,0,0]
["Total miljöpåverkan, kopparrör","kg CO2-eq",0,0,0,0,0,0,0,0,0,0]
["Total miljöpåverkan, PEX-rör","kg CO2-eq",0,0,0,0,0,0,0,0,0,0]
["Total miljöpåverkan, PP-rör","kg CO2-eq",0,0,0,0,0,0,0,0,0,0]
["Total miljöpåverkan, järnrör","kg CO2-eq",0,0,0,0,0,0,0,0,0,0]
["Total miljöpåverkan, stålrör","kg CO2-eq",0,0,0,0,0,0,0,0,0,0]
["Total miljöpåverkan, relining rör","kg CO2-eq",0,0,0,0,0,0,0,0,0,0]
["Total miljöpåverkan, elledning","kg CO2-eq",0,0,0,0,0,0,0,0,0,0]
["Total miljöpåverkan, egen elproduktion","kg CO2-eq",{"$f":"C67*C34+C106*C34","v":0},0,0,0,0,0,0,0,0,0]
["Total miljöpåverkan, drift (värme, kyla, egen elprod)","kg CO2-eq",{"$f":"C75*Miljö!$C$16","v":{"$error":"#N/A"}},{"$f":"D75*Miljö!$C$16","v":0},{"$f":"E75*Miljö!$C$16","v":0},{"$f":"F75*Miljö!$C$16","v":0},{"$f":"G75*Miljö!$C$16","v":0},{"$f":"H75*Miljö!$C$16","v":0},{"$f":"I75*Miljö!$C$16","v":0},{"$f":"J75*Miljö!$C$16","v":0},{"$f":"K75*Miljö!$C$16","v":0},{"$f":"L75*Miljö!$C$16","v":0}]
["Total miljöpåverkan av renoveringen","kg CO2-eq",{"$f":"SUM(C111:C138)+Miljö!C396","v":{"$error":"#N/A"}},{"$f":"SUM(D111:D138)+Miljö!D396","v":0},{"$f":"SUM(E111:E138)+Miljö!E396","v":0},{"$f":"SUM(F111:F138)+Miljö!F396","v":0},{"$f":"SUM(G111:G138)+Miljö!G396","v":0},{"$f":"SUM(H111:H138)+Miljö!H396","v":0},{"$f":"SUM(I111:I138)+Miljö!I396","v":0},{"$f":"SUM(J111:J138)+Miljö!J396","v":0},{"$f":"SUM(K111:K138)+Miljö!K396","v":0},{"$f":"SUM(L111:L138)+Miljö!L396","v":0}]
["Pay-back-tid (Klimatpåverkan)","år",{"$f":"-(C68+C107)/C75","v":{"$error":"#N/A"}},{"$f":"-(D68+D107)/D75","v":{"$error":"#DIV/0!"}},{"$error":"#DIV/0!"},{"$error":"#DIV/0!"},{"$error":"#DIV/0!"},{"$error":"#DIV/0!"},{"$error":"#DIV/0!"},{"$error":"#DIV/0!"},{"$error":"#DIV/0!"},{"$error":"#DIV/0!"}]
[]
[]
["7.3 Primärenergi"]
["7.3.1 Miljöpåverkan renovering"]
["Materialanvändning+trp, isolering 1","kWh",{"$f":"IF(Miljö!C151=TRUE,   INDEX(Material!$A6:$G9, MATCH(Miljö!C153,Material!$A6:$A9, 0),5)*Miljö!C154+Trp!C168,  0)","v":0},{"$f":"IF(Miljö!D151=TRUE,   INDEX(Material!$A6:$G9, MATCH(Miljö!D153,Material!$A6:$A9, 0),5)*Miljö!D154+Trp!D168,  0)","v":0},{"$f":"IF(Miljö!E151=TRUE,   INDEX(Material!$A6:$G9, MATCH(Miljö!E153,Material!$A6:$A9, 0),5)*Miljö!E154+Trp!E168,  0)","v":0},{"$f":"IF(Miljö!F151=TRUE,   INDEX(Material!$A6:$G9, MATCH(Miljö!F153,Material!$A6:$A9, 0),5)*Miljö!F154+Trp!F168,  0)","v":0},{"$f":"IF(Miljö!G151=TRUE,   INDEX(Material!$A6:$G9, MATCH(Miljö!G153,Material!$A6:$A9, 0),5)*Miljö!G154+Trp!G168,  0)","v":0},{"$f":"IF(Miljö!H151=TRUE,   INDEX(Material!$A6:$G9, MATCH(Miljö!H153,Material!$A6:$A9, 0),5)*Miljö!H154+Trp!H168,  0)","v":0},{"$f":"IF(Miljö!I151=TRUE,   INDEX(Material!$A6:$G9, MATCH(Miljö!I153,Material!$A6:$A9, 0),5)*Miljö!I154+Trp!I168,  0)","v":0},{"$f":"IF(Miljö!J151=TRUE,   INDEX(Material!$A6:$G9, MATCH(Miljö!J153,Material!$A6:$A9, 0),5)*Miljö!J154+Trp!J168,  0)","v":0},{"$f":"IF(Miljö!K151=TRUE,   INDEX(Material!$A6:$G9, MATCH(Miljö!K153,Material!$A6:$A9, 0),5)*Miljö!K154+Trp!K168,  0)","v":0},{"$f":"IF(Miljö!L151=TRUE,   INDEX(Material!$A6:$G9, MATCH(Miljö!L153,Material!$A6:$A9, 0),5)*Miljö!L154+Trp!L168,  0)","v":0}]
["Materialanvändning+trp, isolering 2","kWh",{"$f":"IF(Miljö!C161=TRUE,   INDEX(Material!$A6:$G9, MATCH(Miljö!C163,Material!$A6:$A9, 0),5)*Miljö!C164+Trp!C169,  0)","v":0},{"$f":"IF(Miljö!D161=TRUE,   INDEX(Material!$A6:$G9, MATCH(Miljö!D163,Material!$A6:$A9, 0),5)*Miljö!D164+Trp!D169,  0)","v":0},{"$f":"IF(Miljö!E161=TRUE,   INDEX(Material!$A6:$G9, MATCH(Miljö!E163,Material!$A6:$A9, 0),5)*Miljö!E164+Trp!E169,  0)","v":0},{"$f":"IF(Miljö!F161=TRUE,   INDEX(Material!$A6:$G9, MATCH(Miljö!F163,Material!$A6:$A9, 0),5)*Miljö!F164+Trp!F169,  0)","v":0},{"$f":"IF(Miljö!G161=TRUE,   INDEX(Material!$A6:$G9, MATCH(Miljö!G163,Material!$A6:$A9, 0),5)*Miljö!G164+Trp!G169,  0)","v":0},{"$f":"IF(Miljö!H161=TRUE,   INDEX(Material!$A6:$G9, MATCH(Miljö!H163,Material!$A6:$A9, 0),5)*Miljö!H164+Trp!H169,  0)","v":0},{"$f":"IF(Miljö!I161=TRUE,   INDEX(Material!$A6:$G9, MATCH(Miljö!I163,Material!$A6:$A9, 0),5)*Miljö!I164+Trp!I169,  0)","v":0},{"$f":"IF(Miljö!J161=TRUE,   INDEX(Material!$A6:$G9, MATCH(Miljö!J163,Material!$A6:$A9, 0),5)*Miljö!J164+Trp!J169,  0)","v":0},{"$f":"IF(Miljö!K161=TRUE,   INDEX(Material!$A6:$G9, MATCH(Miljö!K163,Material!$A6:$A9, 0),5)*Miljö!K164+Trp!K169,  0)","v":0},{"$f":"IF(Miljö!L161=TRUE,   INDEX(Material!$A6:$G9, MATCH(Miljö!L163,Material!$A6:$A9, 0),5)*Miljö!L164+Trp!L169,  0)","v":0}]
["Materialanvändning+trp, fasadsystem","kWh",{"$f":"IF(Miljö!C171=TRUE,  INDEX(Material!$A33:$G51, MATCH(Miljö!C173,Material!$A33:$A51, 0),5)*Miljö!C174+Trp!C170,  0)","v":0},{"$f":"IF(Miljö!D171=TRUE,  INDEX(Material!$A33:$G51, MATCH(Miljö!D173,Material!$A33:$A51, 0),5)*Miljö!D174+Trp!D170,  0)","v":0},{"$f":"IF(Miljö!E171=TRUE,  INDEX(Material!$A33:$G51, MATCH(Miljö!E173,Material!$A33:$A51, 0),5)*Miljö!E174+Trp!E170,  0)","v":0},{"$f":"IF(Miljö!F171=TRUE,  INDEX(Material!$A33:$G51, MATCH(Miljö!F173,Material!$A33:$A51, 0),5)*Miljö!F174+Trp!F170,  0)","v":0},{"$f":"IF(Miljö!G171=TRUE,  INDEX(Material!$A33:$G51, MATCH(Miljö!G173,Material!$A33:$A51, 0),5)*Miljö!G174+Trp!G170,  0)","v":0},{"$f":"IF(Miljö!H171=TRUE,  INDEX(Material!$A33:$G51, MATCH(Miljö!H173,Material!$A33:$A51, 0),5)*Miljö!H174+Trp!H170,  0)","v":0},{"$f":"IF(Miljö!I171=TRUE,  INDEX(Material!$A33:$G51, MATCH(Miljö!I173,Material!$A33:$A51, 0),5)*Miljö!I174+Trp!I170,  0)","v":0},{"$f":"IF(Miljö!J171=TRUE,  INDEX(Material!$A33:$G51, MATCH(Miljö!J173,Material!$A33:$A51, 0),5)*Miljö!J174+Trp!J170,  0)","v":0},{"$f":"IF(Miljö!K171=TRUE,  INDEX(Material!$A33:$G51, MATCH(Miljö!K173,Material!$A33:$A51, 0),5)*Miljö!K174+Trp!K170,  0)","v":0},{"$f":"IF(Miljö!L171=TRUE,  INDEX(Material!$A33:$G51, MATCH(Miljö!L173,Material!$A33:$A51, 0),5)*Miljö!L174+Trp!L170,  0)","v":0}]
["Materialanvändning+trp, fönster","kWh",{"$f":"IF(Miljö!C181=TRUE,  INDEX(Material!$A15:$G18, MATCH(Miljö!C183,Material!$A15:$A18, 0),5)*Miljö!C184+Trp!C171,  0)","v":0},{"$f":"IF(Miljö!D181=TRUE,  INDEX(Material!$A15:$G18, MATCH(Miljö!D183,Material!$A15:$A18, 0),5)*Miljö!D184+Trp!D171,  0)","v":0},{"$f":"IF(Miljö!E181=TRUE,  INDEX(Material!$A15:$G18, MATCH(Miljö!E183,Material!$A15:$A18, 0),5)*Miljö!E184+Trp!E171,  0)","v":0},{"$f":"IF(Miljö!F181=TRUE,  INDEX(Material!$A15:$G18, MATCH(Miljö!F183,Material!$A15:$A18, 0),5)*Miljö!F184+Trp!F171,  0)","v":0},{"$f":"IF(Miljö!G181=TRUE,  INDEX(Material!$A15:$G18, MATCH(Miljö!G183,Material!$A15:$A18, 0),5)*Miljö!G184+Trp!G171,  0)","v":0},{"$f":"IF(Miljö!H181=TRUE,  INDEX(Material!$A15:$G18, MATCH(Miljö!H183,Material!$A15:$A18, 0),5)*Miljö!H184+Trp!H171,  0)","v":0},{"$f":"IF(Miljö!I181=TRUE,  INDEX(Material!$A15:$G18, MATCH(Miljö!I183,Material!$A15:$A18, 0),5)*Miljö!I184+Trp!I171,  0)","v":0},{"$f":"IF(Miljö!J181=TRUE,  INDEX(Material!$A15:$G18, MATCH(Miljö!J183,Material!$A15:$A18, 0),5)*Miljö!J184+Trp!J171,  0)","v":0},{"$f":"IF(Miljö!K181=TRUE,  INDEX(Material!$A15:$G18, MATCH(Miljö!K183,Material!$A15:$A18, 0),5)*Miljö!K184+Trp!K171,  0)","v":0},{"$f":"IF(Miljö!L181=TRUE,  INDEX(Material!$A15:$G18, MATCH(Miljö!L183,Material!$A15:$A18, 0),5)*Miljö!L184+Trp!L171,  0)","v":0}]
["Materialanvändning+trp, dörrar","kWh",{"$f":"IF(Miljö!C191=TRUE,   INDEX(Material!$A24:$G27, MATCH(Miljö!C193,Material!$A15:$A18, 0),5)*Miljö!C194+Trp!C172,   0)","v":0},{"$f":"IF(Miljö!D191=TRUE,   INDEX(Material!$A24:$G27, MATCH(Miljö!D193,Material!$A15:$A18, 0),5)*Miljö!D194+Trp!D172,   0)","v":0},{"$f":"IF(Miljö!E191=TRUE,   INDEX(Material!$A24:$G27, MATCH(Miljö!E193,Material!$A15:$A18, 0),5)*Miljö!E194+Trp!E172,   0)","v":0},{"$f":"IF(Miljö!F191=TRUE,   INDEX(Material!$A24:$G27, MATCH(Miljö!F193,Material!$A15:$A18, 0),5)*Miljö!F194+Trp!F172,   0)","v":0},{"$f":"IF(Miljö!G191=TRUE,   INDEX(Material!$A24:$G27, MATCH(Miljö!G193,Material!$A15:$A18, 0),5)*Miljö!G194+Trp!G172,   0)","v":0},{"$f":"IF(Miljö!H191=TRUE,   INDEX(Material!$A24:$G27, MATCH(Miljö!H193,Material!$A15:$A18, 0),5)*Miljö!H194+Trp!H172,   0)","v":0},{"$f":"IF(Miljö!I191=TRUE,   INDEX(Material!$A24:$G27, MATCH(Miljö!I193,Material!$A15:$A18, 0),5)*Miljö!I194+Trp!I172,   0)","v":0},{"$f":"IF(Miljö!J191=TRUE,   INDEX(Material!$A24:$G27, MATCH(Miljö!J193,Material!$A15:$A18, 0),5)*Miljö!J194+Trp!J172,   0)","v":0},{"$f":"IF(Miljö!K191=TRUE,   INDEX(Material!$A24:$G27, MATCH(Miljö!K193,Material!$A15:$A18, 0),5)*Miljö!K194+Trp!K172,   0)","v":0},{"$f":"IF(Miljö!L191=TRUE,   INDEX(Material!$A24:$G27, MATCH(Miljö!L193,Material!$A15:$A18, 0),5)*Miljö!L194+Trp!L172,   0)","v":0}]
["Materialanvändning+trp, uppvärmning värmprod","kWh",{"$f":"IF(Miljö!C98=TRUE,INDEX(Uppvärmning!$A$43:$M$49, MATCH(Miljö!C94,Uppvärmning!$A$43:$A$49, 0),4) +Trp!C173,  0)","v":0},{"$f":"IF(Miljö!D98=TRUE,INDEX(Uppvärmning!$A$43:$M$49, MATCH(Miljö!D94,Uppvärmning!$A$43:$A$49, 0),5) +Trp!D173,  0)","v":0},{"$f":"IF(Miljö!E98=TRUE,INDEX(Uppvärmning!$A$43:$M$49, MATCH(Miljö!E94,Uppvärmning!$A$43:$A$49, 0),6) +Trp!E173,  0)","v":0},{"$f":"IF(Miljö!F98=TRUE,INDEX(Uppvärmning!$A$43:$M$49, MATCH(Miljö!F94,Uppvärmning!$A$43:$A$49, 0),7) +Trp!F173,  0)","v":0},{"$f":"IF(Miljö!G98=TRUE,INDEX(Uppvärmning!$A$43:$M$49, MATCH(Miljö!G94,Uppvärmning!$A$43:$A$49, 0),8) +Trp!G173,  0)","v":0},{"$f":"IF(Miljö!H98=TRUE,INDEX(Uppvärmning!$A$43:$M$49, MATCH(Miljö!H94,Uppvärmning!$A$43:$A$49, 0),9) +Trp!H173,  0)","v":0},{"$f":"IF(Miljö!I98=TRUE,INDEX(Uppvärmning!$A$43:$M$49, MATCH(Miljö!I94,Uppvärmning!$A$43:$A$49, 0),10) +Trp!I173,  0)","v":0},{"$f":"IF(Miljö!J98=TRUE,INDEX(Uppvärmning!$A$43:$M$49, MATCH(Miljö!J94,Uppvärmning!$A$43:$A$49, 0),11) +Trp!J173,  0)","v":0},{"$f":"IF(Miljö!K98=TRUE,INDEX(Uppvärmning!$A$43:$M$49, MATCH(Miljö!K94,Uppvärmning!$A$43:$A$49, 0),12) +Trp!K173,  0)","v":0},{"$f":"IF(Miljö!L98=TRUE,INDEX(Uppvärmning!$A$43:$M$49, MATCH(Miljö!L94,Uppvärmning!$A$43:$A$49, 0),13) +Trp!L173,  0)","v":0}]
["Materialanv.+trp, byte uppvärmningsform kringmaterial","kWh",{"$f":"IF(Miljö!C98=TRUE,IF(Miljö!C94=1,Uppvärmning!D50,  IF(Miljö!C94=3,Uppvärmning!D51,   IF(Miljö!C94=4,Uppvärmning!D52,   IF(Miljö!C94=5,Uppvärmning!D53,   0)))),0)","v":0},{"$f":"IF(Miljö!D98=TRUE,IF(Miljö!D94=1,Uppvärmning!E50,  IF(Miljö!D94=3,Uppvärmning!E51,   IF(Miljö!D94=4,Uppvärmning!E52,   IF(Miljö!D94=5,Uppvärmning!E53,   0)))),0)","v":0},{"$f":"IF(Miljö!E98=TRUE,IF(Miljö!E94=1,Uppvärmning!F50,  IF(Miljö!E94=3,Uppvärmning!F51,   IF(Miljö!E94=4,Uppvärmning!F52,   IF(Miljö!E94=5,Uppvärmning!F53,   0)))),0)","v":0},{"$f":"IF(Miljö!F98=TRUE,IF(Miljö!F94=1,Uppvärmning!G50,  IF(Miljö!F94=3,Uppvärmning!G51,   IF(Miljö!F94=4,Uppvärmning!G52,   IF(Miljö!F94=5,Uppvärmning!G53,   0)))),0)","v":0},{"$f":"IF(Miljö!G98=TRUE,IF(Miljö!G94=1,Uppvärmning!H50,  IF(Miljö!G94=3,Uppvärmning!H51,   IF(Miljö!G94=4,Uppvärmning!H52,   IF(Miljö!G94=5,Uppvärmning!H53,   0)))),0)","v":0},{"$f":"IF(Miljö!H98=TRUE,IF(Miljö!H94=1,Uppvärmning!I50,  IF(Miljö!H94=3,Uppvärmning!I51,   IF(Miljö!H94=4,Uppvärmning!I52,   IF(Miljö!H94=5,Uppvärmning!I53,   0)))),0)","v":0},{"$f":"IF(Miljö!I98=TRUE,IF(Miljö!I94=1,Uppvärmning!J50,  IF(Miljö!I94=3,Uppvärmning!J51,   IF(Miljö!I94=4,Uppvärmning!J52,   IF(Miljö!I94=5,Uppvärmning!J53,   0)))),0)","v":0},{"$f":"IF(Miljö!J98=TRUE,IF(Miljö!J94=1,Uppvärmning!K50,  IF(Miljö!J94=3,Uppvärmning!K51,   IF(Miljö!J94=4,Uppvärmning!K52,   IF(Miljö!J94=5,Uppvärmning!K53,   0)))),0)","v":0},{"$f":"IF(Miljö!K98=TRUE,IF(Miljö!K94=1,Uppvärmning!L50,  IF(Miljö!K94=3,Uppvärmning!L51,   IF(Miljö!K94=4,Uppvärmning!L52,   IF(Miljö!K94=5,Uppvärmning!L53,   0)))),0)","v":0},{"$f":"IF(Miljö!L98=TRUE,IF(Miljö!L94=1,Uppvärmning!M50,  IF(Miljö!L94=3,Uppvärmning!M51,   IF(Miljö!L94=4,Uppvärmning!M52,   IF(Miljö!L94=5,Uppvärmning!M53,   0)))),0)","v":0}]
["Materialanvändning+trp, cirkulationspump","kWh",{"$f":"IF(Miljö!C111=TRUE,Miljö!C$113*Material!$E$138 +Trp!C$174,  0)","v":0},{"$f":"IF(Miljö!D111=TRUE,Miljö!D$113*Material!$E$138 +Trp!D$174,  0)","v":0},{"$f":"IF(Miljö!E111=TRUE,Miljö!E$113*Material!$E$138 +Trp!E$174,  0)","v":0},{"$f":"IF(Miljö!F111=TRUE,Miljö!F$113*Material!$E$138 +Trp!F$174,  0)","v":0},{"$f":"IF(Miljö!G111=TRUE,Miljö!G$113*Material!$E$138 +Trp!G$174,  0)","v":0},{"$f":"IF(Miljö!H111=TRUE,Miljö!H$113*Material!$E$138 +Trp!H$174,  0)","v":0},{"$f":"IF(Miljö!I111=TRUE,Miljö!I$113*Material!$E$138 +Trp!I$174,  0)","v":0},{"$f":"IF(Miljö!J111=TRUE,Miljö!J$113*Material!$E$138 +Trp!J$174,  0)","v":0},{"$f":"IF(Miljö!K111=TRUE,Miljö!K$113*Material!$E$138 +Trp!K$174,  0)","v":0},{"$f":"IF(Miljö!L111=TRUE,Miljö!L$113*Material!$E$138 +Trp!L$174,  0)","v":0}]
["Materialanvändning+trp, ventilationskanaler","kWh",{"$f":"IF(Miljö!C365=TRUE,   INDEX(Material!$A110:$G113, MATCH(Miljö!C367,Material!$A110:$A113, 0),5)*Miljö!C368+Trp!C175,0)","v":0},{"$f":"IF(Miljö!D365=TRUE,   INDEX(Material!$A110:$G113, MATCH(Miljö!D367,Material!$A110:$A113, 0),5)*Miljö!D368+Trp!D175,0)","v":0},{"$f":"IF(Miljö!E365=TRUE,   INDEX(Material!$A110:$G113, MATCH(Miljö!E367,Material!$A110:$A113, 0),5)*Miljö!E368+Trp!E175,0)","v":0},{"$f":"IF(Miljö!F365=TRUE,   INDEX(Material!$A110:$G113, MATCH(Miljö!F367,Material!$A110:$A113, 0),5)*Miljö!F368+Trp!F175,0)","v":0},{"$f":"IF(Miljö!G365=TRUE,   INDEX(Material!$A110:$G113, MATCH(Miljö!G367,Material!$A110:$A113, 0),5)*Miljö!G368+Trp!G175,0)","v":0},{"$f":"IF(Miljö!H365=TRUE,   INDEX(Material!$A110:$G113, MATCH(Miljö!H367,Material!$A110:$A113, 0),5)*Miljö!H368+Trp!H175,0)","v":0},{"$f":"IF(Miljö!I365=TRUE,   INDEX(Material!$A110:$G113, MATCH(Miljö!I367,Material!$A110:$A113, 0),5)*Miljö!I368+Trp!I175,0)","v":0},{"$f":"IF(Miljö!J365=TRUE,   INDEX(Material!$A110:$G113, MATCH(Miljö!J367,Material!$A110:$A113, 0),5)*Miljö!J368+Trp!J175,0)","v":0},{"$f":"IF(Miljö!K365=TRUE,   INDEX(Material!$A110:$G113, MATCH(Miljö!K367,Material!$A110:$A113, 0),5)*Miljö!K368+Trp!K175,0)","v":0},{"$f":"IF(Miljö!L365=TRUE,   INDEX(Material!$A110:$G113, MATCH(Miljö!L367,Material!$A110:$A113, 0),5)*Miljö!L368+Trp!L175,0)","v":0}]
["Materialanvändning+trp, luftflödesaggregat","kWh",{"$f":"IF(Miljö!C120=TRUE,  INDEX(Material!$A119:$G122, MATCH(Miljö!C122,Material!$A119:$A122, 0),5)*Miljö!C123+Trp!C176,0)","v":0},{"$f":"IF(Miljö!D120=TRUE,  INDEX(Material!$A119:$G122, MATCH(Miljö!D122,Material!$A119:$A122, 0),5)*Miljö!D123+Trp!D176,0)","v":0},{"$f":"IF(Miljö!E120=TRUE,  INDEX(Material!$A119:$G122, MATCH(Miljö!E122,Material!$A119:$A122, 0),5)*Miljö!E123+Trp!E176,0)","v":0},{"$f":"IF(Miljö!F120=TRUE,  INDEX(Material!$A119:$G122, MATCH(Miljö!F122,Material!$A119:$A122, 0),5)*Miljö!F123+Trp!F176,0)","v":0},{"$f":"IF(Miljö!G120=TRUE,  INDEX(Material!$A119:$G122, MATCH(Miljö!G122,Material!$A119:$A122, 0),5)*Miljö!G123+Trp!G176,0)","v":0},{"$f":"IF(Miljö!H120=TRUE,  INDEX(Material!$A119:$G122, MATCH(Miljö!H122,Material!$A119:$A122, 0),5)*Miljö!H123+Trp!H176,0)","v":0},{"$f":"IF(Miljö!I120=TRUE,  INDEX(Material!$A119:$G122, MATCH(Miljö!I122,Material!$A119:$A122, 0),5)*Miljö!I123+Trp!I176,0)","v":0},{"$f":"IF(Miljö!J120=TRUE,  INDEX(Material!$A119:$G122, MATCH(Miljö!J122,Material!$A119:$A122, 0),5)*Miljö!J123+Trp!J176,0)","v":0},{"$f":"IF(Miljö!K120=TRUE,  INDEX(Material!$A119:$G122, MATCH(Miljö!K122,Material!$A119:$A122, 0),5)*Miljö!K123+Trp!K176,0)","v":0},{"$f":"IF(Miljö!L120=TRUE,  INDEX(Material!$A119:$G122, MATCH(Miljö!L122,Material!$A119:$A122, 0),5)*Miljö!L123+Trp!L176,0)","v":0}]
["Materialanvändning+trp, don och dämpare (vent)","kWh",{"$f":"  IF(Miljö!C375=TRUE,Material!$E$128*Miljö!C377+Trp!C177,0)","v":0},{"$f":"  IF(Miljö!D375=TRUE,Material!$E$128*Miljö!D377+Trp!D177,0)","v":0},{"$f":"  IF(Miljö!E375=TRUE,Material!$E$128*Miljö!E377+Trp!E177,0)","v":0},{"$f":"  IF(Miljö!F375=TRUE,Material!$E$128*Miljö!F377+Trp!F177,0)","v":0},{"$f":"  IF(Miljö!G375=TRUE,Material!$E$128*Miljö!G377+Trp!G177,0)","v":0},{"$f":"  IF(Miljö!H375=TRUE,Material!$E$128*Miljö!H377+Trp!H177,0)","v":0},{"$f":"  IF(Miljö!I375=TRUE,Material!$E$128*Miljö!I377+Trp!I177,0)","v":0},{"$f":"  IF(Miljö!J375=TRUE,Material!$E$128*Miljö!J377+Trp!J177,0)","v":0},{"$f":"  IF(Miljö!K375=TRUE,Material!$E$128*Miljö!K377+Trp!K177,0)","v":0},{"$f":"  IF(Miljö!L375=TRUE,Material!$E$128*Miljö!L377+Trp!L177,0)","v":0}]
["Trä konstruktionsvirke","kWh",{"$f":"IF(Miljö!C$204=TRUE,Material!$E$57*Miljö!C$206+Trp!C180,0)","v":0},{"$f":"IF(Miljö!D$204=TRUE,Material!$E$57*Miljö!D$206+Trp!D180,0)","v":0},{"$f":"IF(Miljö!E$204=TRUE,Material!$E$57*Miljö!E$206+Trp!E180,0)","v":0},{"$f":"IF(Miljö!F$204=TRUE,Material!$E$57*Miljö!F$206+Trp!F180,0)","v":0},{"$f":"IF(Miljö!G$204=TRUE,Material!$E$57*Miljö!G$206+Trp!G180,0)","v":0},{"$f":"IF(Miljö!H$204=TRUE,Material!$E$57*Miljö!H$206+Trp!H180,0)","v":0},{"$f":"IF(Miljö!I$204=TRUE,Material!$E$57*Miljö!I$206+Trp!I180,0)","v":0},{"$f":"IF(Miljö!J$204=TRUE,Material!$E$57*Miljö!J$206+Trp!J180,0)","v":0},{"$f":"IF(Miljö!K$204=TRUE,Material!$E$57*Miljö!K$206+Trp!K180,0)","v":0},{"$f":"IF(Miljö!L$204=TRUE,Material!$E$57*Miljö!L$206+Trp!L180,0)","v":0}]
["Trä målad träfasad","kWh",{"$f":"IF(Miljö!C$213=TRUE,Material!$E$58*Miljö!C$215+Trp!C181,0)","v":0},{"$f":"IF(Miljö!D$213=TRUE,Material!$E$58*Miljö!D$215+Trp!D181,0)","v":0},{"$f":"IF(Miljö!E$213=TRUE,Material!$E$58*Miljö!E$215+Trp!E181,0)","v":0},{"$f":"IF(Miljö!F$213=TRUE,Material!$E$58*Miljö!F$215+Trp!F181,0)","v":0},{"$f":"IF(Miljö!G$213=TRUE,Material!$E$58*Miljö!G$215+Trp!G181,0)","v":0},{"$f":"IF(Miljö!H$213=TRUE,Material!$E$58*Miljö!H$215+Trp!H181,0)","v":0},{"$f":"IF(Miljö!I$213=TRUE,Material!$E$58*Miljö!I$215+Trp!I181,0)","v":0},{"$f":"IF(Miljö!J$213=TRUE,Material!$E$58*Miljö!J$215+Trp!J181,0)","v":0},{"$f":"IF(Miljö!K$213=TRUE,Material!$E$58*Miljö!K$215+Trp!K181,0)","v":0},{"$f":"IF(Miljö!L$213=TRUE,Material!$E$58*Miljö!L$215+Trp!L181,0)","v":0}]
["Trä invändig träpanel","kWh",{"$f":"IF(Miljö!C$222=TRUE,Material!$E$59*Miljö!C$224+Trp!C182,0)","v":0},{"$f":"IF(Miljö!D$222=TRUE,Material!$E$59*Miljö!D$224+Trp!D182,0)","v":0},{"$f":"IF(Miljö!E$222=TRUE,Material!$E$59*Miljö!E$224+Trp!E182,0)","v":0},{"$f":"IF(Miljö!F$222=TRUE,Material!$E$59*Miljö!F$224+Trp!F182,0)","v":0},{"$f":"IF(Miljö!G$222=TRUE,Material!$E$59*Miljö!G$224+Trp!G182,0)","v":0},{"$f":"IF(Miljö!H$222=TRUE,Material!$E$59*Miljö!H$224+Trp!H182,0)","v":0},{"$f":"IF(Miljö!I$222=TRUE,Material!$E$59*Miljö!I$224+Trp!I182,0)","v":0},{"$f":"IF(Miljö!J$222=TRUE,Material!$E$59*Miljö!J$224+Trp!J182,0)","v":0},{"$f":"IF(Miljö!K$222=TRUE,Material!$E$59*Miljö!K$224+Trp!K182,0)","v":0},{"$f":"IF(Miljö!L$222=TRUE,Material!$E$59*Miljö!L$224+Trp!L182,0)","v":0}]
["Betong bjälklag","kWh",{"$f":"IF(Miljö!C$231=TRUE,INDEX(Material!$A$65:$G$67,MATCH(Miljö!C$233,Material!$A$65:$A$67,0),5)*Miljö!C$234+Trp!C183,0)","v":0},{"$f":"IF(Miljö!D$231=TRUE,INDEX(Material!$A$65:$G$67,MATCH(Miljö!D$233,Material!$A$65:$A$67,0),5)*Miljö!D$234+Trp!D183,0)","v":0},{"$f":"IF(Miljö!E$231=TRUE,INDEX(Material!$A$65:$G$67,MATCH(Miljö!E$233,Material!$A$65:$A$67,0),5)*Miljö!E$234+Trp!E183,0)","v":0},{"$f":"IF(Miljö!F$231=TRUE,INDEX(Material!$A$65:$G$67,MATCH(Miljö!F$233,Material!$A$65:$A$67,0),5)*Miljö!F$234+Trp!F183,0)","v":0},{"$f":"IF(Miljö!G$231=TRUE,INDEX(Material!$A$65:$G$67,MATCH(Miljö!G$233,Material!$A$65:$A$67,0),5)*Miljö!G$234+Trp!G183,0)","v":0},{"$f":"IF(Miljö!H$231=TRUE,INDEX(Material!$A$65:$G$67,MATCH(Miljö!H$233,Material!$A$65:$A$67,0),5)*Miljö!H$234+Trp!H183,0)","v":0},{"$f":"IF(Miljö!I$231=TRUE,INDEX(Material!$A$65:$G$67,MATCH(Miljö!I$233,Material!$A$65:$A$67,0),5)*Miljö!I$234+Trp!I183,0)","v":0},{"$f":"IF(Miljö!J$231=TRUE,INDEX(Material!$A$65:$G$67,MATCH(Miljö!J$233,Material!$A$65:$A$67,0),5)*Miljö!J$234+Trp!J183,0)","v":0},{"$f":"IF(Miljö!K$231=TRUE,INDEX(Material!$A$65:$G$67,MATCH(Miljö!K$233,Material!$A$65:$A$67,0),5)*Miljö!K$234+Trp!K183,0)","v":0},{"$f":"IF(Miljö!L$231=TRUE,INDEX(Material!$A$65:$G$67,MATCH(Miljö!L$233,Material!$A$65:$A$67,0),5)*Miljö!L$234+Trp!L183,0)","v":0}]
["Betong bärande ytterväggar","kWh",{"$f":"IF(Miljö!C$241=TRUE,INDEX(Material!$A$74:$G$75,MATCH(Miljö!C$243,Material!$A$74:$A$75,0),5)*Miljö!C$244+Trp!C184,0)","v":0},{"$f":"IF(Miljö!D$241=TRUE,INDEX(Material!$A$74:$G$75,MATCH(Miljö!D$243,Material!$A$74:$A$75,0),5)*Miljö!D$244+Trp!D184,0)","v":0},{"$f":"IF(Miljö!E$241=TRUE,INDEX(Material!$A$74:$G$75,MATCH(Miljö!E$243,Material!$A$74:$A$75,0),5)*Miljö!E$244+Trp!E184,0)","v":0},{"$f":"IF(Miljö!F$241=TRUE,INDEX(Material!$A$74:$G$75,MATCH(Miljö!F$243,Material!$A$74:$A$75,0),5)*Miljö!F$244+Trp!F184,0)","v":0},{"$f":"IF(Miljö!G$241=TRUE,INDEX(Material!$A$74:$G$75,MATCH(Miljö!G$243,Material!$A$74:$A$75,0),5)*Miljö!G$244+Trp!G184,0)","v":0},{"$f":"IF(Miljö!H$241=TRUE,INDEX(Material!$A$74:$G$75,MATCH(Miljö!H$243,Material!$A$74:$A$75,0),5)*Miljö!H$244+Trp!H184,0)","v":0},{"$f":"IF(Miljö!I$241=TRUE,INDEX(Material!$A$74:$G$75,MATCH(Miljö!I$243,Material!$A$74:$A$75,0),5)*Miljö!I$244+Trp!I184,0)","v":0},{"$f":"IF(Miljö!J$241=TRUE,INDEX(Material!$A$74:$G$75,MATCH(Miljö!J$243,Material!$A$74:$A$75,0),5)*Miljö!J$244+Trp!J184,0)","v":0},{"$f":"IF(Miljö!K$241=TRUE,INDEX(Material!$A$74:$G$75,MATCH(Miljö!K$243,Material!$A$74:$A$75,0),5)*Miljö!K$244+Trp!K184,0)","v":0},{"$f":"IF(Miljö!L$241=TRUE,INDEX(Material!$A$74:$G$75,MATCH(Miljö!L$243,Material!$A$74:$A$75,0),5)*Miljö!L$244+Trp!L184,0)","v":0}]
["Betong icke-bärande ytterväggar","kWh",{"$f":"IF(Miljö!C$251=TRUE,Material!$E$77*Miljö!C$253+Trp!C185,0)","v":0},{"$f":"IF(Miljö!D$251=TRUE,Material!$E$77*Miljö!D$253+Trp!D185,0)","v":0},{"$f":"IF(Miljö!E$251=TRUE,Material!$E$77*Miljö!E$253+Trp!E185,0)","v":0},{"$f":"IF(Miljö!F$251=TRUE,Material!$E$77*Miljö!F$253+Trp!F185,0)","v":0},{"$f":"IF(Miljö!G$251=TRUE,Material!$E$77*Miljö!G$253+Trp!G185,0)","v":0},{"$f":"IF(Miljö!H$251=TRUE,Material!$E$77*Miljö!H$253+Trp!H185,0)","v":0},{"$f":"IF(Miljö!I$251=TRUE,Material!$E$77*Miljö!I$253+Trp!I185,0)","v":0},{"$f":"IF(Miljö!J$251=TRUE,Material!$E$77*Miljö!J$253+Trp!J185,0)","v":0},{"$f":"IF(Miljö!K$251=TRUE,Material!$E$77*Miljö!K$253+Trp!K185,0)","v":0},{"$f":"IF(Miljö!L$251=TRUE,Material!$E$77*Miljö!L$253+Trp!L185,0)","v":0}]
["Betong innerväggar","kWh",{"$f":"IF(Miljö!C$260=TRUE,INDEX(Material!$A$84:$G$85,MATCH(Miljö!C$262,Material!$A$84:$A$85,0),5)*Miljö!C$263+Trp!C186,0)","v":0},{"$f":"IF(Miljö!D$260=TRUE,INDEX(Material!$A$84:$G$85,MATCH(Miljö!D$262,Material!$A$84:$A$85,0),5)*Miljö!D$263+Trp!D186,0)","v":0},{"$f":"IF(Miljö!E$260=TRUE,INDEX(Material!$A$84:$G$85,MATCH(Miljö!E$262,Material!$A$84:$A$85,0),5)*Miljö!E$263+Trp!E186,0)","v":0},{"$f":"IF(Miljö!F$260=TRUE,INDEX(Material!$A$84:$G$85,MATCH(Miljö!F$262,Material!$A$84:$A$85,0),5)*Miljö!F$263+Trp!F186,0)","v":0},{"$f":"IF(Miljö!G$260=TRUE,INDEX(Material!$A$84:$G$85,MATCH(Miljö!G$262,Material!$A$84:$A$85,0),5)*Miljö!G$263+Trp!G186,0)","v":0},{"$f":"IF(Miljö!H$260=TRUE,INDEX(Material!$A$84:$G$85,MATCH(Miljö!H$262,Material!$A$84:$A$85,0),5)*Miljö!H$263+Trp!H186,0)","v":0},{"$f":"IF(Miljö!I$260=TRUE,INDEX(Material!$A$84:$G$85,MATCH(Miljö!I$262,Material!$A$84:$A$85,0),5)*Miljö!I$263+Trp!I186,0)","v":0},{"$f":"IF(Miljö!J$260=TRUE,INDEX(Material!$A$84:$G$85,MATCH(Miljö!J$262,Material!$A$84:$A$85,0),5)*Miljö!J$263+Trp!J186,0)","v":0},{"$f":"IF(Miljö!K$260=TRUE,INDEX(Material!$A$84:$G$85,MATCH(Miljö!K$262,Material!$A$84:$A$85,0),5)*Miljö!K$263+Trp!K186,0)","v":0},{"$f":"IF(Miljö!L$260=TRUE,INDEX(Material!$A$84:$G$85,MATCH(Miljö!L$262,Material!$A$84:$A$85,0),5)*Miljö!L$263+Trp!L186,0)","v":0}]
["Puts","kWh",{"$f":"IF(Miljö!C$270=TRUE,Material!$E$90*Miljö!C$272+Trp!C187,0)","v":0},{"$f":"IF(Miljö!D$270=TRUE,Material!$E$90*Miljö!D$272+Trp!D187,0)","v":0},{"$f":"IF(Miljö!E$270=TRUE,Material!$E$90*Miljö!E$272+Trp!E187,0)","v":0},{"$f":"IF(Miljö!F$270=TRUE,Material!$E$90*Miljö!F$272+Trp!F187,0)","v":0},{"$f":"IF(Miljö!G$270=TRUE,Material!$E$90*Miljö!G$272+Trp!G187,0)","v":0},{"$f":"IF(Miljö!H$270=TRUE,Material!$E$90*Miljö!H$272+Trp!H187,0)","v":0},{"$f":"IF(Miljö!I$270=TRUE,Material!$E$90*Miljö!I$272+Trp!I187,0)","v":0},{"$f":"IF(Miljö!J$270=TRUE,Material!$E$90*Miljö!J$272+Trp!J187,0)","v":0},{"$f":"IF(Miljö!K$270=TRUE,Material!$E$90*Miljö!K$272+Trp!K187,0)","v":0},{"$f":"IF(Miljö!L$270=TRUE,Material!$E$90*Miljö!L$272+Trp!L187,0)","v":0}]
["Gipsskivor","kWh",{"$f":"IF(Miljö!C$279=TRUE,Material!$E$91*Miljö!C$281+Trp!C188,0)","v":0},{"$f":"IF(Miljö!D$279=TRUE,Material!$E$91*Miljö!D$281+Trp!D188,0)","v":0},{"$f":"IF(Miljö!E$279=TRUE,Material!$E$91*Miljö!E$281+Trp!E188,0)","v":0},{"$f":"IF(Miljö!F$279=TRUE,Material!$E$91*Miljö!F$281+Trp!F188,0)","v":0},{"$f":"IF(Miljö!G$279=TRUE,Material!$E$91*Miljö!G$281+Trp!G188,0)","v":0},{"$f":"IF(Miljö!H$279=TRUE,Material!$E$91*Miljö!H$281+Trp!H188,0)","v":0},{"$f":"IF(Miljö!I$279=TRUE,Material!$E$91*Miljö!I$281+Trp!I188,0)","v":0},{"$f":"IF(Miljö!J$279=TRUE,Material!$E$91*Miljö!J$281+Trp!J188,0)","v":0},{"$f":"IF(Miljö!K$279=TRUE,Material!$E$91*Miljö!K$281+Trp!K188,0)","v":0},{"$f":"IF(Miljö!L$279=TRUE,Material!$E$91*Miljö!L$281+Trp!L188,0)","v":0}]
["Takbeläggning","kWh",{"$f":"IF(Miljö!C$288=TRUE,INDEX(Material!$A$98:$G$102,MATCH(Miljö!C$290,Material!$A$98:$A$102,0),5)*Miljö!C$291+Trp!C189,0)","v":0},{"$f":"IF(Miljö!D$288=TRUE,INDEX(Material!$A$98:$G$102,MATCH(Miljö!D$290,Material!$A$98:$A$102,0),5)*Miljö!D$291+Trp!D189,0)","v":0},{"$f":"IF(Miljö!E$288=TRUE,INDEX(Material!$A$98:$G$102,MATCH(Miljö!E$290,Material!$A$98:$A$102,0),5)*Miljö!E$291+Trp!E189,0)","v":0},{"$f":"IF(Miljö!F$288=TRUE,INDEX(Material!$A$98:$G$102,MATCH(Miljö!F$290,Material!$A$98:$A$102,0),5)*Miljö!F$291+Trp!F189,0)","v":0},{"$f":"IF(Miljö!G$288=TRUE,INDEX(Material!$A$98:$G$102,MATCH(Miljö!G$290,Material!$A$98:$A$102,0),5)*Miljö!G$291+Trp!G189,0)","v":0},{"$f":"IF(Miljö!H$288=TRUE,INDEX(Material!$A$98:$G$102,MATCH(Miljö!H$290,Material!$A$98:$A$102,0),5)*Miljö!H$291+Trp!H189,0)","v":0},{"$f":"IF(Miljö!I$288=TRUE,INDEX(Material!$A$98:$G$102,MATCH(Miljö!I$290,Material!$A$98:$A$102,0),5)*Miljö!I$291+Trp!I189,0)","v":0},{"$f":"IF(Miljö!J$288=TRUE,INDEX(Material!$A$98:$G$102,MATCH(Miljö!J$290,Material!$A$98:$A$102,0),5)*Miljö!J$291+Trp!J189,0)","v":0},{"$f":"IF(Miljö!K$288=TRUE,INDEX(Material!$A$98:$G$102,MATCH(Miljö!K$290,Material!$A$98:$A$102,0),5)*Miljö!K$291+Trp!K189,0)","v":0},{"$f":"IF(Miljö!L$288=TRUE,INDEX(Material!$A$98:$G$102,MATCH(Miljö!L$290,Material!$A$98:$A$102,0),5)*Miljö!L$291+Trp!L189,0)","v":0}]
["Materialanvändning+trp, radiatorer","kWh",{"$f":"IF(Miljö!C301=TRUE,   INDEX(Material!$A$146:$G$149, MATCH(Miljö!C303,Material!$A$146:$A$149, 0),5)*Miljö!C304+Trp!C190,  0)","v":0},{"$f":"IF(Miljö!D301=TRUE,   INDEX(Material!$A$146:$G$149, MATCH(Miljö!D303,Material!$A$146:$A$149, 0),5)*Miljö!D304+Trp!D190,  0)","v":0},{"$f":"IF(Miljö!E301=TRUE,   INDEX(Material!$A$146:$G$149, MATCH(Miljö!E303,Material!$A$146:$A$149, 0),5)*Miljö!E304+Trp!E190,  0)","v":0},{"$f":"IF(Miljö!F301=TRUE,   INDEX(Material!$A$146:$G$149, MATCH(Miljö!F303,Material!$A$146:$A$149, 0),5)*Miljö!F304+Trp!F190,  0)","v":0},{"$f":"IF(Miljö!G301=TRUE,   INDEX(Material!$A$146:$G$149, MATCH(Miljö!G303,Material!$A$146:$A$149, 0),5)*Miljö!G304+Trp!G190,  0)","v":0},{"$f":"IF(Miljö!H301=TRUE,   INDEX(Material!$A$146:$G$149, MATCH(Miljö!H303,Material!$A$146:$A$149, 0),5)*Miljö!H304+Trp!H190,  0)","v":0},{"$f":"IF(Miljö!I301=TRUE,   INDEX(Material!$A$146:$G$149, MATCH(Miljö!I303,Material!$A$146:$A$149, 0),5)*Miljö!I304+Trp!I190,  0)","v":0},{"$f":"IF(Miljö!J301=TRUE,   INDEX(Material!$A$146:$G$149, MATCH(Miljö!J303,Material!$A$146:$A$149, 0),5)*Miljö!J304+Trp!J190,  0)","v":0},{"$f":"IF(Miljö!K301=TRUE,   INDEX(Material!$A$146:$G$149, MATCH(Miljö!K303,Material!$A$146:$A$149, 0),5)*Miljö!K304+Trp!K190,  0)","v":0},{"$f":"IF(Miljö!L301=TRUE,   INDEX(Material!$A$146:$G$149, MATCH(Miljö!L303,Material!$A$146:$A$149, 0),5)*Miljö!L304+Trp!L190,  0)","v":0}]
["Materialanvändning+trp, kopparrör","kWh",{"$f":"IF(Miljö!C311=TRUE,Miljö!C313*Material!$E$155+Trp!C191,0)","v":0},{"$f":"IF(Miljö!D311=TRUE,Miljö!D313*Material!$E$155+Trp!D191,0)","v":0},{"$f":"IF(Miljö!E311=TRUE,Miljö!E313*Material!$E$155+Trp!E191,0)","v":0},{"$f":"IF(Miljö!F311=TRUE,Miljö!F313*Material!$E$155+Trp!F191,0)","v":0},{"$f":"IF(Miljö!G311=TRUE,Miljö!G313*Material!$E$155+Trp!G191,0)","v":0},{"$f":"IF(Miljö!H311=TRUE,Miljö!H313*Material!$E$155+Trp!H191,0)","v":0},{"$f":"IF(Miljö!I311=TRUE,Miljö!I313*Material!$E$155+Trp!I191,0)","v":0},{"$f":"IF(Miljö!J311=TRUE,Miljö!J313*Material!$E$155+Trp!J191,0)","v":0},{"$f":"IF(Miljö!K311=TRUE,Miljö!K313*Material!$E$155+Trp!K191,0)","v":0},{"$f":"IF(Miljö!L311=TRUE,Miljö!L313*Material!$E$155+Trp!L191,0)","v":0}]
["Materialanvändning+trp, PEX-rör","kWh",{"$f":"IF(Miljö!C320=TRUE,Miljö!C322*Material!$E$156+Trp!C192,0)","v":0},{"$f":"IF(Miljö!D320=TRUE,Miljö!D322*Material!$E$156+Trp!D192,0)","v":0},{"$f":"IF(Miljö!E320=TRUE,Miljö!E322*Material!$E$156+Trp!E192,0)","v":0},{"$f":"IF(Miljö!F320=TRUE,Miljö!F322*Material!$E$156+Trp!F192,0)","v":0},{"$f":"IF(Miljö!G320=TRUE,Miljö!G322*Material!$E$156+Trp!G192,0)","v":0},{"$f":"IF(Miljö!H320=TRUE,Miljö!H322*Material!$E$156+Trp!H192,0)","v":0},{"$f":"IF(Miljö!I320=TRUE,Miljö!I322*Material!$E$156+Trp!I192,0)","v":0},{"$f":"IF(Miljö!J320=TRUE,Miljö!J322*Material!$E$156+Trp!J192,0)","v":0},{"$f":"IF(Miljö!K320=TRUE,Miljö!K322*Material!$E$156+Trp!K192,0)","v":0},{"$f":"IF(Miljö!L320=TRUE,Miljö!L322*Material!$E$156+Trp!L192,0)","v":0}]
["Materialanvändning+trp, PP-rör","kWh",{"$f":"IF(Miljö!C329=TRUE,Miljö!C331*Material!$E$157+Trp!C193,0)","v":0},{"$f":"IF(Miljö!D329=TRUE,Miljö!D331*Material!$E$157+Trp!D193,0)","v":0},{"$f":"IF(Miljö!E329=TRUE,Miljö!E331*Material!$E$157+Trp!E193,0)","v":0},{"$f":"IF(Miljö!F329=TRUE,Miljö!F331*Material!$E$157+Trp!F193,0)","v":0},{"$f":"IF(Miljö!G329=TRUE,Miljö!G331*Material!$E$157+Trp!G193,0)","v":0},{"$f":"IF(Miljö!H329=TRUE,Miljö!H331*Material!$E$157+Trp!H193,0)","v":0},{"$f":"IF(Miljö!I329=TRUE,Miljö!I331*Material!$E$157+Trp!I193,0)","v":0},{"$f":"IF(Miljö!J329=TRUE,Miljö!J331*Material!$E$157+Trp!J193,0)","v":0},{"$f":"IF(Miljö!K329=TRUE,Miljö!K331*Material!$E$157+Trp!K193,0)","v":0},{"$f":"IF(Miljö!L329=TRUE,Miljö!L331*Material!$E$157+Trp!L193,0)","v":0}]
["Materialanvändning+trp, järnrör","kWh",{"$f":"IF(Miljö!C338=TRUE,Miljö!C340*Material!$E$158+Trp!C194,0)","v":0},{"$f":"IF(Miljö!D338=TRUE,Miljö!D340*Material!$E$158+Trp!D194,0)","v":0},{"$f":"IF(Miljö!E338=TRUE,Miljö!E340*Material!$E$158+Trp!E194,0)","v":0},{"$f":"IF(Miljö!F338=TRUE,Miljö!F340*Material!$E$158+Trp!F194,0)","v":0},{"$f":"IF(Miljö!G338=TRUE,Miljö!G340*Material!$E$158+Trp!G194,0)","v":0},{"$f":"IF(Miljö!H338=TRUE,Miljö!H340*Material!$E$158+Trp!H194,0)","v":0},{"$f":"IF(Miljö!I338=TRUE,Miljö!I340*Material!$E$158+Trp!I194,0)","v":0},{"$f":"IF(Miljö!J338=TRUE,Miljö!J340*Material!$E$158+Trp!J194,0)","v":0},{"$f":"IF(Miljö!K338=TRUE,Miljö!K340*Material!$E$158+Trp!K194,0)","v":0},{"$f":"IF(Miljö!L338=TRUE,Miljö!L340*Material!$E$158+Trp!L194,0)","v":0}]
["Materialanvändning+trp, stålrör","kWh",{"$f":"IF(Miljö!C347=TRUE,Miljö!C349*Material!$E$159+Trp!C195,0)","v":0},{"$f":"IF(Miljö!D347=TRUE,Miljö!D349*Material!$E$159+Trp!D195,0)","v":0},{"$f":"IF(Miljö!E347=TRUE,Miljö!E349*Material!$E$159+Trp!E195,0)","v":0},{"$f":"IF(Miljö!F347=TRUE,Miljö!F349*Material!$E$159+Trp!F195,0)","v":0},{"$f":"IF(Miljö!G347=TRUE,Miljö!G349*Material!$E$159+Trp!G195,0)","v":0},{"$f":"IF(Miljö!H347=TRUE,Miljö!H349*Material!$E$159+Trp!H195,0)","v":0},{"$f":"IF(Miljö!I347=TRUE,Miljö!I349*Material!$E$159+Trp!I195,0)","v":0},{"$f":"IF(Miljö!J347=TRUE,Miljö!J349*Material!$E$159+Trp!J195,0)","v":0},{"$f":"IF(Miljö!K347=TRUE,Miljö!K349*Material!$E$159+Trp!K195,0)","v":0},{"$f":"IF(Miljö!L347=TRUE,Miljö!L349*Material!$E$159+Trp!L195,0)","v":0}]
["Materialanvändning+trp, relining rör","kWh",{"$f":"IF(Miljö!C356=TRUE,Miljö!C358*Material!$E$174+Trp!C197,0)","v":0},{"$f":"IF(Miljö!D356=TRUE,Miljö!D358*Material!$E$174+Trp!D197,0)","v":0},{"$f":"IF(Miljö!E356=TRUE,Miljö!E358*Material!$E$174+Trp!E197,0)","v":0},{"$f":"IF(Miljö!F356=TRUE,Miljö!F358*Material!$E$174+Trp!F197,0)","v":0},{"$f":"IF(Miljö!G356=TRUE,Miljö!G358*Material!$E$174+Trp!G197,0)","v":0},{"$f":"IF(Miljö!H356=TRUE,Miljö!H358*Material!$E$174+Trp!H197,0)","v":0},{"$f":"IF(Miljö!I356=TRUE,Miljö!I358*Material!$E$174+Trp!I197,0)","v":0},{"$f":"IF(Miljö!J356=TRUE,Miljö!J358*Material!$E$174+Trp!J197,0)","v":0},{"$f":"IF(Miljö!K356=TRUE,Miljö!K358*Material!$E$174+Trp!K197,0)","v":0},{"$f":"IF(Miljö!L356=TRUE,Miljö!L358*Material!$E$174+Trp!L197,0)","v":0}]
["Materialanvändning+trp, elledning","kWh",{"$f":"IF(Miljö!C384=TRUE,Miljö!C386*Material!$E$174+Trp!C198,0)","v":0},{"$f":"IF(Miljö!D384=TRUE,Miljö!D386*Material!$E$174+Trp!D198,0)","v":0},{"$f":"IF(Miljö!E384=TRUE,Miljö!E386*Material!$E$174+Trp!E198,0)","v":0},{"$f":"IF(Miljö!F384=TRUE,Miljö!F386*Material!$E$174+Trp!F198,0)","v":0},{"$f":"IF(Miljö!G384=TRUE,Miljö!G386*Material!$E$174+Trp!G198,0)","v":0},{"$f":"IF(Miljö!H384=TRUE,Miljö!H386*Material!$E$174+Trp!H198,0)","v":0},{"$f":"IF(Miljö!I384=TRUE,Miljö!I386*Material!$E$174+Trp!I198,0)","v":0},{"$f":"IF(Miljö!J384=TRUE,Miljö!J386*Material!$E$174+Trp!J198,0)","v":0},{"$f":"IF(Miljö!K384=TRUE,Miljö!K386*Material!$E$174+Trp!K198,0)","v":0},{"$f":"IF(Miljö!L384=TRUE,Miljö!L386*Material!$E$174+Trp!L198,0)","v":0}]
["Materialanvädning, Egen elproduktion","kWh",{"$f":"IF(Miljö!C130=TRUE,INDEX(Material!$A$183:$G$186,MATCH(Miljö!C132,Material!$A$183:$A$186,0),5)*Miljö!C133+Trp!C179,0)","v":0},{"$f":"IF(Miljö!D130=TRUE,INDEX(Material!$A$183:$G$186,MATCH(Miljö!D132,Material!$A$183:$A$186,0),5)*Miljö!D133+Trp!D179,0)","v":0},{"$f":"IF(Miljö!E130=TRUE,INDEX(Material!$A$183:$G$186,MATCH(Miljö!E132,Material!$A$183:$A$186,0),5)*Miljö!E133+Trp!E179,0)","v":0},{"$f":"IF(Miljö!F130=TRUE,INDEX(Material!$A$183:$G$186,MATCH(Miljö!F132,Material!$A$183:$A$186,0),5)*Miljö!F133+Trp!F179,0)","v":0},{"$f":"IF(Miljö!G130=TRUE,INDEX(Material!$A$183:$G$186,MATCH(Miljö!G132,Material!$A$183:$A$186,0),5)*Miljö!G133+Trp!G179,0)","v":0},{"$f":"IF(Miljö!H130=TRUE,INDEX(Material!$A$183:$G$186,MATCH(Miljö!H132,Material!$A$183:$A$186,0),5)*Miljö!H133+Trp!H179,0)","v":0},{"$f":"IF(Miljö!I130=TRUE,INDEX(Material!$A$183:$G$186,MATCH(Miljö!I132,Material!$A$183:$A$186,0),5)*Miljö!I133+Trp!I179,0)","v":0},{"$f":"IF(Miljö!J130=TRUE,INDEX(Material!$A$183:$G$186,MATCH(Miljö!J132,Material!$A$183:$A$186,0),5)*Miljö!J133+Trp!J179,0)","v":0},{"$f":"IF(Miljö!K130=TRUE,INDEX(Material!$A$183:$G$186,MATCH(Miljö!K132,Material!$A$183:$A$186,0),5)*Miljö!K133+Trp!K179,0)","v":0},{"$f":"IF(Miljö!L130=TRUE,INDEX(Material!$A$183:$G$186,MATCH(Miljö!L132,Material!$A$183:$A$186,0),5)*Miljö!L133+Trp!L179,0)","v":0}]
["Total miljöpåverkan renovering","kWh",{"$f":"SUM(C145:C174)","v":0},{"$f":"SUM(D145:D174)","v":0},0,0,0,0,0,{"$f":"SUM(J145:J174)","v":0},0,0]
[]
["7.3.2 Årlig miljöpåverkan efter renovering","Negativa värden visar en miljöbesparing jämfört med referensfallet där ingen renovering görs"]
["Årlig miljöpåverkan, ändrat värmebehov","kWh/år",{"$f":"INDEX(Uppvärmning!$A6:$I12, MATCH(Miljö!C93,Uppvärmning!$A6:$A12, 0),4)*Miljö!C144","v":{"$error":"#N/A"}},{"$f":"INDEX(Uppvärmning!$A6:$I12, MATCH(Miljö!D93,Uppvärmning!$A6:$A12, 0),4)*Miljö!D144","v":0},{"$f":"INDEX(Uppvärmning!$A6:$I12, MATCH(Miljö!E93,Uppvärmning!$A6:$A12, 0),4)*Miljö!E144","v":0},{"$f":"INDEX(Uppvärmning!$A6:$I12, MATCH(Miljö!F93,Uppvärmning!$A6:$A12, 0),4)*Miljö!F144","v":0},{"$f":"INDEX(Uppvärmning!$A6:$I12, MATCH(Miljö!G93,Uppvärmning!$A6:$A12, 0),4)*Miljö!G144","v":0},{"$f":"INDEX(Uppvärmning!$A6:$I12, MATCH(Miljö!H93,Uppvärmning!$A6:$A12, 0),4)*Miljö!H144","v":0},{"$f":"INDEX(Uppvärmning!$A6:$I12, MATCH(Miljö!I93,Uppvärmning!$A6:$A12, 0),4)*Miljö!I144","v":0},{"$f":"INDEX(Uppvärmning!$A6:$I12, MATCH(Miljö!J93,Uppvärmning!$A6:$A12, 0),4)*Miljö!J144","v":0},{"$f":"INDEX(Uppvärmning!$A6:$I12, MATCH(Miljö!K93,Uppvärmning!$A6:$A12, 0),4)*Miljö!K144","v":0},{"$f":"INDEX(Uppvärmning!$A6:$I12, MATCH(Miljö!L93,Uppvärmning!$A6:$A12, 0),4)*Miljö!L144","v":0}]
["Årlig miljöpåverkan, ändrat elbehov","kWh/år",{"$f":"Uppvärmning!$D$11*Miljö!C145","v":0},{"$f":"Uppvärmning!$D$11*Miljö!D145","v":0},{"$f":"Uppvärmning!$D$11*Miljö!E145","v":0},{"$f":"Uppvärmning!$D$11*Miljö!F145","v":0},{"$f":"Uppvärmning!$D$11*Miljö!G145","v":0},{"$f":"Uppvärmning!$D$11*Miljö!H145","v":0},{"$f":"Uppvärmning!$D$11*Miljö!I145","v":0},{"$f":"Uppvärmning!$D$11*Miljö!J145","v":0},{"$f":"Uppvärmning!$D$11*Miljö!K145","v":0},{"$f":"Uppvärmning!$D$11*Miljö!L145","v":0}]
["Årlig miljöpåverkan, byte uppvärmning","kWh/år",{"$f":"IF(Miljö!C98=TRUE,Miljö!C95*Uppvärmning!D63,0)","v":0},{"$f":"IF(Miljö!D98=TRUE,Miljö!D95*Uppvärmning!E63,0)","v":0},{"$f":"IF(Miljö!E98=TRUE,Miljö!E95*Uppvärmning!F63,0)","v":0},{"$f":"IF(Miljö!F98=TRUE,Miljö!F95*Uppvärmning!G63,0)","v":0},{"$f":"IF(Miljö!G98=TRUE,Miljö!G95*Uppvärmning!H63,0)","v":0},{"$f":"IF(Miljö!H98=TRUE,Miljö!H95*Uppvärmning!I63,0)","v":0},{"$f":"IF(Miljö!I98=TRUE,Miljö!I95*Uppvärmning!J63,0)","v":0},{"$f":"IF(Miljö!J98=TRUE,Miljö!J95*Uppvärmning!K63,0)","v":0},{"$f":"IF(Miljö!K98=TRUE,Miljö!K95*Uppvärmning!L63,0)","v":0},{"$f":"IF(Miljö!L98=TRUE,Miljö!L95*Uppvärmning!M63,0)","v":0}]
["Årlig miljöpåverkan, Egen elproduktion","kWh/år",{"$f":"-Uppvärmning!$D$11*Miljö!C134","v":0},{"$f":"-Uppvärmning!$D$11*Miljö!D134","v":0},{"$f":"-Uppvärmning!$D$11*Miljö!E134","v":0},{"$f":"-Uppvärmning!$D$11*Miljö!F134","v":0},{"$f":"-Uppvärmning!$D$11*Miljö!G134","v":0},{"$f":"-Uppvärmning!$D$11*Miljö!H134","v":0},{"$f":"-Uppvärmning!$D$11*Miljö!I134","v":0},{"$f":"-Uppvärmning!$D$11*Miljö!J134","v":0},{"$f":"-Uppvärmning!$D$11*Miljö!K134","v":0},{"$f":"-Uppvärmning!$D$11*Miljö!L134","v":0}]
["Total miljöpåverkan per år","kWh/år",{"$f":"SUM(C178:C181)","v":{"$error":"#N/A"}},0,0,0,0,0,0,0,0,0]
[]
["7.3.3 Miljöpåverkan avfallshantering","Negativa värden visar en miljöbesparing jämfört med referensfallet där ingen renovering görs"]
["Miljöpåverkan avfallshantering, isolering 1","kWh",{"$f":"IF(Miljö!C151=TRUE,   INDEX(Material!$A$6:$G$9, MATCH(Miljö!C153,Material!$A6:$A9, 0),7)*Miljö!C154,  0)","v":0},{"$f":"IF(Miljö!D151=TRUE,   INDEX(Material!$A$6:$G$9, MATCH(Miljö!D153,Material!$A6:$A9, 0),7)*Miljö!D154,  0)","v":0},{"$f":"IF(Miljö!E151=TRUE,   INDEX(Material!$A$6:$G$9, MATCH(Miljö!E153,Material!$A6:$A9, 0),7)*Miljö!E154,  0)","v":0},{"$f":"IF(Miljö!F151=TRUE,   INDEX(Material!$A$6:$G$9, MATCH(Miljö!F153,Material!$A6:$A9, 0),7)*Miljö!F154,  0)","v":0},{"$f":"IF(Miljö!G151=TRUE,   INDEX(Material!$A$6:$G$9, MATCH(Miljö!G153,Material!$A6:$A9, 0),7)*Miljö!G154,  0)","v":0},{"$f":"IF(Miljö!H151=TRUE,   INDEX(Material!$A$6:$G$9, MATCH(Miljö!H153,Material!$A6:$A9, 0),7)*Miljö!H154,  0)","v":0},{"$f":"IF(Miljö!I151=TRUE,   INDEX(Material!$A$6:$G$9, MATCH(Miljö!I153,Material!$A6:$A9, 0),7)*Miljö!I154,  0)","v":0},{"$f":"IF(Miljö!J151=TRUE,   INDEX(Material!$A$6:$G$9, MATCH(Miljö!J153,Material!$A6:$A9, 0),7)*Miljö!J154,  0)","v":0},{"$f":"IF(Miljö!K151=TRUE,   INDEX(Material!$A$6:$G$9, MATCH(Miljö!K153,Material!$A6:$A9, 0),7)*Miljö!K154,  0)","v":0},{"$f":"IF(Miljö!L151=TRUE,   INDEX(Material!$A$6:$G$9, MATCH(Miljö!L153,Material!$A6:$A9, 0),7)*Miljö!L154,  0)","v":0}]
["Miljöpåverkan avfallshantering, isolering 2","kWh",{"$f":"IF(Miljö!C161=TRUE,   INDEX(Material!$A$6:$G$9, MATCH(Miljö!C163,Material!$A6:$A9, 0),7)*Miljö!C164,  0)","v":0},{"$f":"IF(Miljö!D161=TRUE,   INDEX(Material!$A$6:$G$9, MATCH(Miljö!D163,Material!$A6:$A9, 0),7)*Miljö!D164,  0)","v":0},{"$f":"IF(Miljö!E161=TRUE,   INDEX(Material!$A$6:$G$9, MATCH(Miljö!E163,Material!$A6:$A9, 0),7)*Miljö!E164,  0)","v":0},{"$f":"IF(Miljö!F161=TRUE,   INDEX(Material!$A$6:$G$9, MATCH(Miljö!F163,Material!$A6:$A9, 0),7)*Miljö!F164,  0)","v":0},{"$f":"IF(Miljö!G161=TRUE,   INDEX(Material!$A$6:$G$9, MATCH(Miljö!G163,Material!$A6:$A9, 0),7)*Miljö!G164,  0)","v":0},{"$f":"IF(Miljö!H161=TRUE,   INDEX(Material!$A$6:$G$9, MATCH(Miljö!H163,Material!$A6:$A9, 0),7)*Miljö!H164,  0)","v":0},{"$f":"IF(Miljö!I161=TRUE,   INDEX(Material!$A$6:$G$9, MATCH(Miljö!I163,Material!$A6:$A9, 0),7)*Miljö!I164,  0)","v":0},{"$f":"IF(Miljö!J161=TRUE,   INDEX(Material!$A$6:$G$9, MATCH(Miljö!J163,Material!$A6:$A9, 0),7)*Miljö!J164,  0)","v":0},{"$f":"IF(Miljö!K161=TRUE,   INDEX(Material!$A$6:$G$9, MATCH(Miljö!K163,Material!$A6:$A9, 0),7)*Miljö!K164,  0)","v":0},{"$f":"IF(Miljö!L161=TRUE,   INDEX(Material!$A$6:$G$9, MATCH(Miljö!L163,Material!$A6:$A9, 0),7)*Miljö!L164,  0)","v":0}]
["Miljöpåverkan avfallshantering, fasadsystem","kWh",{"$f":"IF(Miljö!C171=TRUE,  INDEX(Material!$A33:$G51, MATCH(Miljö!C173,Material!$A33:$A51, 0),7)*Miljö!C174,  0)","v":0},{"$f":"IF(Miljö!D171=TRUE,  INDEX(Material!$A33:$G51, MATCH(Miljö!D173,Material!$A33:$A51, 0),7)*Miljö!D174,  0)","v":0},{"$f":"IF(Miljö!E171=TRUE,  INDEX(Material!$A33:$G51, MATCH(Miljö!E173,Material!$A33:$A51, 0),7)*Miljö!E174,  0)","v":0},{"$f":"IF(Miljö!F171=TRUE,  INDEX(Material!$A33:$G51, MATCH(Miljö!F173,Material!$A33:$A51, 0),7)*Miljö!F174,  0)","v":0},{"$f":"IF(Miljö!G171=TRUE,  INDEX(Material!$A33:$G51, MATCH(Miljö!G173,Material!$A33:$A51, 0),7)*Miljö!G174,  0)","v":0},{"$f":"IF(Miljö!H171=TRUE,  INDEX(Material!$A33:$G51, MATCH(Miljö!H173,Material!$A33:$A51, 0),7)*Miljö!H174,  0)","v":0},{"$f":"IF(Miljö!I171=TRUE,  INDEX(Material!$A33:$G51, MATCH(Miljö!I173,Material!$A33:$A51, 0),7)*Miljö!I174,  0)","v":0},{"$f":"IF(Miljö!J171=TRUE,  INDEX(Material!$A33:$G51, MATCH(Miljö!J173,Material!$A33:$A51, 0),7)*Miljö!J174,  0)","v":0},{"$f":"IF(Miljö!K171=TRUE,  INDEX(Material!$A33:$G51, MATCH(Miljö!K173,Material!$A33:$A51, 0),7)*Miljö!K174,  0)","v":0},{"$f":"IF(Miljö!L171=TRUE,  INDEX(Material!$A33:$G51, MATCH(Miljö!L173,Material!$A33:$A51, 0),7)*Miljö!L174,  0)","v":0}]
["Miljöpåverkan avfallshantering, fönster","kWh",{"$f":"IF(Miljö!C181=TRUE,  INDEX(Material!$A15:$G18, MATCH(Miljö!C183,Material!$A15:$A18, 0),7)*Miljö!C184,  0)","v":0},{"$f":"IF(Miljö!D181=TRUE,  INDEX(Material!$A15:$G18, MATCH(Miljö!D183,Material!$A15:$A18, 0),7)*Miljö!D184,  0)","v":0},{"$f":"IF(Miljö!E181=TRUE,  INDEX(Material!$A15:$G18, MATCH(Miljö!E183,Material!$A15:$A18, 0),7)*Miljö!E184,  0)","v":0},{"$f":"IF(Miljö!F181=TRUE,  INDEX(Material!$A15:$G18, MATCH(Miljö!F183,Material!$A15:$A18, 0),7)*Miljö!F184,  0)","v":0},{"$f":"IF(Miljö!G181=TRUE,  INDEX(Material!$A15:$G18, MATCH(Miljö!G183,Material!$A15:$A18, 0),7)*Miljö!G184,  0)","v":0},{"$f":"IF(Miljö!H181=TRUE,  INDEX(Material!$A15:$G18, MATCH(Miljö!H183,Material!$A15:$A18, 0),7)*Miljö!H184,  0)","v":0},{"$f":"IF(Miljö!I181=TRUE,  INDEX(Material!$A15:$G18, MATCH(Miljö!I183,Material!$A15:$A18, 0),7)*Miljö!I184,  0)","v":0},{"$f":"IF(Miljö!J181=TRUE,  INDEX(Material!$A15:$G18, MATCH(Miljö!J183,Material!$A15:$A18, 0),7)*Miljö!J184,  0)","v":0},{"$f":"IF(Miljö!K181=TRUE,  INDEX(Material!$A15:$G18, MATCH(Miljö!K183,Material!$A15:$A18, 0),7)*Miljö!K184,  0)","v":0},{"$f":"IF(Miljö!L181=TRUE,  INDEX(Material!$A15:$G18, MATCH(Miljö!L183,Material!$A15:$A18, 0),7)*Miljö!L184,  0)","v":0}]
["Miljöpåverkan avfallshantering, dörrar","kWh",{"$f":"IF(Miljö!C191=TRUE,   INDEX(Material!$A24:$G27, MATCH(Miljö!C193,Material!$A15:$A18, 0),7)*Miljö!C194,   0)","v":0},{"$f":"IF(Miljö!D191=TRUE,   INDEX(Material!$A24:$G27, MATCH(Miljö!D193,Material!$A15:$A18, 0),7)*Miljö!D194,   0)","v":0},{"$f":"IF(Miljö!E191=TRUE,   INDEX(Material!$A24:$G27, MATCH(Miljö!E193,Material!$A15:$A18, 0),7)*Miljö!E194,   0)","v":0},{"$f":"IF(Miljö!F191=TRUE,   INDEX(Material!$A24:$G27, MATCH(Miljö!F193,Material!$A15:$A18, 0),7)*Miljö!F194,   0)","v":0},{"$f":"IF(Miljö!G191=TRUE,   INDEX(Material!$A24:$G27, MATCH(Miljö!G193,Material!$A15:$A18, 0),7)*Miljö!G194,   0)","v":0},{"$f":"IF(Miljö!H191=TRUE,   INDEX(Material!$A24:$G27, MATCH(Miljö!H193,Material!$A15:$A18, 0),7)*Miljö!H194,   0)","v":0},{"$f":"IF(Miljö!I191=TRUE,   INDEX(Material!$A24:$G27, MATCH(Miljö!I193,Material!$A15:$A18, 0),7)*Miljö!I194,   0)","v":0},{"$f":"IF(Miljö!J191=TRUE,   INDEX(Material!$A24:$G27, MATCH(Miljö!J193,Material!$A15:$A18, 0),7)*Miljö!J194,   0)","v":0},{"$f":"IF(Miljö!K191=TRUE,   INDEX(Material!$A24:$G27, MATCH(Miljö!K193,Material!$A15:$A18, 0),7)*Miljö!K194,   0)","v":0},{"$f":"IF(Miljö!L191=TRUE,   INDEX(Material!$A24:$G27, MATCH(Miljö!L193,Material!$A15:$A18, 0),7)*Miljö!L194,   0)","v":0}]
["Miljöpåverkan avfallshantering, byte uppvärmning","kWh",{"$f":"IF(Miljö!C98=TRUE,INDEX(Uppvärmning!$A$75:$M$81, MATCH(Miljö!C94,Uppvärmning!$A$75:$A$81, 0),4),  0)","v":0},{"$f":"IF(Miljö!D98=TRUE,INDEX(Uppvärmning!$A$75:$M$81, MATCH(Miljö!D94,Uppvärmning!$A$75:$A$81, 0),5),  0)","v":0},{"$f":"IF(Miljö!E98=TRUE,INDEX(Uppvärmning!$A$75:$M$81, MATCH(Miljö!E94,Uppvärmning!$A$75:$A$81, 0),6),  0)","v":0},{"$f":"IF(Miljö!F98=TRUE,INDEX(Uppvärmning!$A$75:$M$81, MATCH(Miljö!F94,Uppvärmning!$A$75:$A$81, 0),7),  0)","v":0},{"$f":"IF(Miljö!G98=TRUE,INDEX(Uppvärmning!$A$75:$M$81, MATCH(Miljö!G94,Uppvärmning!$A$75:$A$81, 0),8),  0)","v":0},{"$f":"IF(Miljö!H98=TRUE,INDEX(Uppvärmning!$A$75:$M$81, MATCH(Miljö!H94,Uppvärmning!$A$75:$A$81, 0),9),  0)","v":0},{"$f":"IF(Miljö!I98=TRUE,INDEX(Uppvärmning!$A$75:$M$81, MATCH(Miljö!I94,Uppvärmning!$A$75:$A$81, 0),10),  0)","v":0},{"$f":"IF(Miljö!J98=TRUE,INDEX(Uppvärmning!$A$75:$M$81, MATCH(Miljö!J94,Uppvärmning!$A$75:$A$81, 0),11),  0)","v":0},{"$f":"IF(Miljö!K98=TRUE,INDEX(Uppvärmning!$A$75:$M$81, MATCH(Miljö!K94,Uppvärmning!$A$75:$A$81, 0),12),  0)","v":0},{"$f":"IF(Miljö!L98=TRUE,INDEX(Uppvärmning!$A$75:$M$81, MATCH(Miljö!L94,Uppvärmning!$A$75:$A$81, 0),13),  0)","v":0},"Avfallshantering av kringutrustning (t.ex. borrhål och oljetank) ej inkluderad"]
["Miljöpåverkan avfallshantering, cirkulationspump","kWh",{"$f":"IF(Miljö!C111=TRUE,Miljö!C$113*Material!$G$138,  0)","v":0},{"$f":"IF(Miljö!D111=TRUE,Miljö!D$113*Material!$G$138,  0)","v":0},{"$f":"IF(Miljö!E111=TRUE,Miljö!E$113*Material!$G$138,  0)","v":0},{"$f":"IF(Miljö!F111=TRUE,Miljö!F$113*Material!$G$138,  0)","v":0},{"$f":"IF(Miljö!G111=TRUE,Miljö!G$113*Material!$G$138,  0)","v":0},{"$f":"IF(Miljö!H111=TRUE,Miljö!H$113*Material!$G$138,  0)","v":0},{"$f":"IF(Miljö!I111=TRUE,Miljö!I$113*Material!$G$138,  0)","v":0},{"$f":"IF(Miljö!J111=TRUE,Miljö!J$113*Material!$G$138,  0)","v":0},{"$f":"IF(Miljö!K111=TRUE,Miljö!K$113*Material!$G$138,  0)","v":0},{"$f":"IF(Miljö!L111=TRUE,Miljö!L$113*Material!$G$138,  0)","v":0}]
["Miljöpåverkan avfallshantering, ventilationskanaler","kWh",{"$f":"IF(Miljö!C365=TRUE,  INDEX(Material!$A110:$G113, MATCH(Miljö!C367,Material!$A110:$A113, 0),7)*Miljö!C368,0)","v":0},{"$f":"IF(Miljö!D365=TRUE,  INDEX(Material!$A110:$G113, MATCH(Miljö!D367,Material!$A110:$A113, 0),7)*Miljö!D368,0)","v":0},{"$f":"IF(Miljö!E365=TRUE,  INDEX(Material!$A110:$G113, MATCH(Miljö!E367,Material!$A110:$A113, 0),7)*Miljö!E368,0)","v":0},{"$f":"IF(Miljö!F365=TRUE,  INDEX(Material!$A110:$G113, MATCH(Miljö!F367,Material!$A110:$A113, 0),7)*Miljö!F368,0)","v":0},{"$f":"IF(Miljö!G365=TRUE,  INDEX(Material!$A110:$G113, MATCH(Miljö!G367,Material!$A110:$A113, 0),7)*Miljö!G368,0)","v":0},{"$f":"IF(Miljö!H365=TRUE,  INDEX(Material!$A110:$G113, MATCH(Miljö!H367,Material!$A110:$A113, 0),7)*Miljö!H368,0)","v":0},{"$f":"IF(Miljö!I365=TRUE,  INDEX(Material!$A110:$G113, MATCH(Miljö!I367,Material!$A110:$A113, 0),7)*Miljö!I368,0)","v":0},{"$f":"IF(Miljö!J365=TRUE,  INDEX(Material!$A110:$G113, MATCH(Miljö!J367,Material!$A110:$A113, 0),7)*Miljö!J368,0)","v":0},{"$f":"IF(Miljö!K365=TRUE,  INDEX(Material!$A110:$G113, MATCH(Miljö!K367,Material!$A110:$A113, 0),7)*Miljö!K368,0)","v":0},{"$f":"IF(Miljö!L365=TRUE,  INDEX(Material!$A110:$G113, MATCH(Miljö!L367,Material!$A110:$A113, 0),7)*Miljö!L368,0)","v":0}]
["Miljöpåverkan avfallshantering, luftflödesaggregat","kWh",{"$f":"  IF(Miljö!C120=TRUE,INDEX(Material!$A119:$G122, MATCH(Miljö!C122,Material!$A119:$A122, 0),7)*Miljö!C123,0)","v":0},{"$f":"  IF(Miljö!D120=TRUE,INDEX(Material!$A119:$G122, MATCH(Miljö!D122,Material!$A119:$A122, 0),7)*Miljö!D123,0)","v":0},{"$f":"  IF(Miljö!E120=TRUE,INDEX(Material!$A119:$G122, MATCH(Miljö!E122,Material!$A119:$A122, 0),7)*Miljö!E123,0)","v":0},{"$f":"  IF(Miljö!F120=TRUE,INDEX(Material!$A119:$G122, MATCH(Miljö!F122,Material!$A119:$A122, 0),7)*Miljö!F123,0)","v":0},{"$f":"  IF(Miljö!G120=TRUE,INDEX(Material!$A119:$G122, MATCH(Miljö!G122,Material!$A119:$A122, 0),7)*Miljö!G123,0)","v":0},{"$f":"  IF(Miljö!H120=TRUE,INDEX(Material!$A119:$G122, MATCH(Miljö!H122,Material!$A119:$A122, 0),7)*Miljö!H123,0)","v":0},{"$f":"  IF(Miljö!I120=TRUE,INDEX(Material!$A119:$G122, MATCH(Miljö!I122,Material!$A119:$A122, 0),7)*Miljö!I123,0)","v":0},{"$f":"  IF(Miljö!J120=TRUE,INDEX(Material!$A119:$G122, MATCH(Miljö!J122,Material!$A119:$A122, 0),7)*Miljö!J123,0)","v":0},{"$f":"  IF(Miljö!K120=TRUE,INDEX(Material!$A119:$G122, MATCH(Miljö!K122,Material!$A119:$A122, 0),7)*Miljö!K123,0)","v":0},{"$f":"  IF(Miljö!L120=TRUE,INDEX(Material!$A119:$G122, MATCH(Miljö!L122,Material!$A119:$A122, 0),7)*Miljö!L123,0)","v":0}]
["Miljöpåverkan avfallshantering, don och dämpare (vent)","kWh",{"$f":" IF(Miljö!C375=TRUE,Material!$G$128*Miljö!C377,0)","v":0},{"$f":" IF(Miljö!D375=TRUE,Material!$G$128*Miljö!D377,0)","v":0},{"$f":" IF(Miljö!E375=TRUE,Material!$G$128*Miljö!E377,0)","v":0},{"$f":" IF(Miljö!F375=TRUE,Material!$G$128*Miljö!F377,0)","v":0},{"$f":" IF(Miljö!G375=TRUE,Material!$G$128*Miljö!G377,0)","v":0},{"$f":" IF(Miljö!H375=TRUE,Material!$G$128*Miljö!H377,0)","v":0},{"$f":" IF(Miljö!I375=TRUE,Material!$G$128*Miljö!I377,0)","v":0},{"$f":" IF(Miljö!J375=TRUE,Material!$G$128*Miljö!J377,0)","v":0},{"$f":" IF(Miljö!K375=TRUE,Material!$G$128*Miljö!K377,0)","v":0},{"$f":" IF(Miljö!L375=TRUE,Material!$G$128*Miljö!L377,0)","v":0}]
["Trä konstruktionsvirke","kWh",{"$f":"IF(Miljö!C$204=TRUE,Material!$G$57*Miljö!C$206,0)","v":0},{"$f":"IF(Miljö!D$204=TRUE,Material!$G$57*Miljö!D$206,0)","v":0},{"$f":"IF(Miljö!E$204=TRUE,Material!$G$57*Miljö!E$206,0)","v":0},{"$f":"IF(Miljö!F$204=TRUE,Material!$G$57*Miljö!F$206,0)","v":0},{"$f":"IF(Miljö!G$204=TRUE,Material!$G$57*Miljö!G$206,0)","v":0},{"$f":"IF(Miljö!H$204=TRUE,Material!$G$57*Miljö!H$206,0)","v":0},{"$f":"IF(Miljö!I$204=TRUE,Material!$G$57*Miljö!I$206,0)","v":0},{"$f":"IF(Miljö!J$204=TRUE,Material!$G$57*Miljö!J$206,0)","v":0},{"$f":"IF(Miljö!K$204=TRUE,Material!$G$57*Miljö!K$206,0)","v":0},{"$f":"IF(Miljö!L$204=TRUE,Material!$G$57*Miljö!L$206,0)","v":0}]
["Trä målad träfasad","kWh",{"$f":"IF(Miljö!C$213=TRUE,Material!$G$58*Miljö!C$215,0)","v":0},{"$f":"IF(Miljö!D$213=TRUE,Material!$G$58*Miljö!D$215,0)","v":0},{"$f":"IF(Miljö!E$213=TRUE,Material!$G$58*Miljö!E$215,0)","v":0},{"$f":"IF(Miljö!F$213=TRUE,Material!$G$58*Miljö!F$215,0)","v":0},{"$f":"IF(Miljö!G$213=TRUE,Material!$G$58*Miljö!G$215,0)","v":0},{"$f":"IF(Miljö!H$213=TRUE,Material!$G$58*Miljö!H$215,0)","v":0},{"$f":"IF(Miljö!I$213=TRUE,Material!$G$58*Miljö!I$215,0)","v":0},{"$f":"IF(Miljö!J$213=TRUE,Material!$G$58*Miljö!J$215,0)","v":0},{"$f":"IF(Miljö!K$213=TRUE,Material!$G$58*Miljö!K$215,0)","v":0},{"$f":"IF(Miljö!L$213=TRUE,Material!$G$58*Miljö!L$215,0)","v":0}]
["Trä invändig träpanel","kWh",{"$f":"IF(Miljö!C$222=TRUE,Material!$G$59*Miljö!C$224,0)","v":0},{"$f":"IF(Miljö!D$222=TRUE,Material!$G$59*Miljö!D$224,0)","v":0},{"$f":"IF(Miljö!E$222=TRUE,Material!$G$59*Miljö!E$224,0)","v":0},{"$f":"IF(Miljö!F$222=TRUE,Material!$G$59*Miljö!F$224,0)","v":0},{"$f":"IF(Miljö!G$222=TRUE,Material!$G$59*Miljö!G$224,0)","v":0},{"$f":"IF(Miljö!H$222=TRUE,Material!$G$59*Miljö!H$224,0)","v":0},{"$f":"IF(Miljö!I$222=TRUE,Material!$G$59*Miljö!I$224,0)","v":0},{"$f":"IF(Miljö!J$222=TRUE,Material!$G$59*Miljö!J$224,0)","v":0},{"$f":"IF(Miljö!K$222=TRUE,Material!$G$59*Miljö!K$224,0)","v":0},{"$f":"IF(Miljö!L$222=TRUE,Material!$G$59*Miljö!L$224,0)","v":0}]
["Betong bjälklag","kWh",{"$f":"IF(Miljö!C$231=TRUE,INDEX(Material!$A$65:$G$67,MATCH(Miljö!C$233,Material!$A$65:$A$67,0),7)*Miljö!C$234,0)","v":0},{"$f":"IF(Miljö!D$231=TRUE,INDEX(Material!$A$65:$G$67,MATCH(Miljö!D$233,Material!$A$65:$A$67,0),7)*Miljö!D$234,0)","v":0},{"$f":"IF(Miljö!E$231=TRUE,INDEX(Material!$A$65:$G$67,MATCH(Miljö!E$233,Material!$A$65:$A$67,0),7)*Miljö!E$234,0)","v":0},{"$f":"IF(Miljö!F$231=TRUE,INDEX(Material!$A$65:$G$67,MATCH(Miljö!F$233,Material!$A$65:$A$67,0),7)*Miljö!F$234,0)","v":0},{"$f":"IF(Miljö!G$231=TRUE,INDEX(Material!$A$65:$G$67,MATCH(Miljö!G$233,Material!$A$65:$A$67,0),7)*Miljö!G$234,0)","v":0},{"$f":"IF(Miljö!H$231=TRUE,INDEX(Material!$A$65:$G$67,MATCH(Miljö!H$233,Material!$A$65:$A$67,0),7)*Miljö!H$234,0)","v":0},{"$f":"IF(Miljö!I$231=TRUE,INDEX(Material!$A$65:$G$67,MATCH(Miljö!I$233,Material!$A$65:$A$67,0),7)*Miljö!I$234,0)","v":0},{"$f":"IF(Miljö!J$231=TRUE,INDEX(Material!$A$65:$G$67,MATCH(Miljö!J$233,Material!$A$65:$A$67,0),7)*Miljö!J$234,0)","v":0},{"$f":"IF(Miljö!K$231=TRUE,INDEX(Material!$A$65:$G$67,MATCH(Miljö!K$233,Material!$A$65:$A$67,0),7)*Miljö!K$234,0)","v":0},{"$f":"IF(Miljö!L$231=TRUE,INDEX(Material!$A$65:$G$67,MATCH(Miljö!L$233,Material!$A$65:$A$67,0),7)*Miljö!L$234,0)","v":0}]
["Betong bärande ytterväggar","kWh",{"$f":"IF(Miljö!C$241=TRUE,INDEX(Material!$A$74:$G$75,MATCH(Miljö!C$243,Material!$A$74:$A$75,0),7)*Miljö!C$244,0)","v":0},{"$f":"IF(Miljö!D$241=TRUE,INDEX(Material!$A$74:$G$75,MATCH(Miljö!D$243,Material!$A$74:$A$75,0),7)*Miljö!D$244,0)","v":0},{"$f":"IF(Miljö!E$241=TRUE,INDEX(Material!$A$74:$G$75,MATCH(Miljö!E$243,Material!$A$74:$A$75,0),7)*Miljö!E$244,0)","v":0},{"$f":"IF(Miljö!F$241=TRUE,INDEX(Material!$A$74:$G$75,MATCH(Miljö!F$243,Material!$A$74:$A$75,0),7)*Miljö!F$244,0)","v":0},{"$f":"IF(Miljö!G$241=TRUE,INDEX(Material!$A$74:$G$75,MATCH(Miljö!G$243,Material!$A$74:$A$75,0),7)*Miljö!G$244,0)","v":0},{"$f":"IF(Miljö!H$241=TRUE,INDEX(Material!$A$74:$G$75,MATCH(Miljö!H$243,Material!$A$74:$A$75,0),7)*Miljö!H$244,0)","v":0},{"$f":"IF(Miljö!I$241=TRUE,INDEX(Material!$A$74:$G$75,MATCH(Miljö!I$243,Material!$A$74:$A$75,0),7)*Miljö!I$244,0)","v":0},{"$f":"IF(Miljö!J$241=TRUE,INDEX(Material!$A$74:$G$75,MATCH(Miljö!J$243,Material!$A$74:$A$75,0),7)*Miljö!J$244,0)","v":0},{"$f":"IF(Miljö!K$241=TRUE,INDEX(Material!$A$74:$G$75,MATCH(Miljö!K$243,Material!$A$74:$A$75,0),7)*Miljö!K$244,0)","v":0},{"$f":"IF(Miljö!L$241=TRUE,INDEX(Material!$A$74:$G$75,MATCH(Miljö!L$243,Material!$A$74:$A$75,0),7)*Miljö!L$244,0)","v":0}]
["Betong icke-bärande ytterväggar","kWh",{"$f":"IF(Miljö!C$251=TRUE,Material!$G$77*Miljö!C$253,0)","v":0},{"$f":"IF(Miljö!D$251=TRUE,Material!$G$77*Miljö!D$253,0)","v":0},{"$f":"IF(Miljö!E$251=TRUE,Material!$G$77*Miljö!E$253,0)","v":0},{"$f":"IF(Miljö!F$251=TRUE,Material!$G$77*Miljö!F$253,0)","v":0},{"$f":"IF(Miljö!G$251=TRUE,Material!$G$77*Miljö!G$253,0)","v":0},{"$f":"IF(Miljö!H$251=TRUE,Material!$G$77*Miljö!H$253,0)","v":0},{"$f":"IF(Miljö!I$251=TRUE,Material!$G$77*Miljö!I$253,0)","v":0},{"$f":"IF(Miljö!J$251=TRUE,Material!$G$77*Miljö!J$253,0)","v":0},{"$f":"IF(Miljö!K$251=TRUE,Material!$G$77*Miljö!K$253,0)","v":0},{"$f":"IF(Miljö!L$251=TRUE,Material!$G$77*Miljö!L$253,0)","v":0}]
["Betong innerväggar","kWh",{"$f":"IF(Miljö!C$260=TRUE,INDEX(Material!$A$84:$G$85,MATCH(Miljö!C$262,Material!$A$84:$A$85,0),7)*Miljö!C$263,0)","v":0},{"$f":"IF(Miljö!D$260=TRUE,INDEX(Material!$A$84:$G$85,MATCH(Miljö!D$262,Material!$A$84:$A$85,0),7)*Miljö!D$263,0)","v":0},{"$f":"IF(Miljö!E$260=TRUE,INDEX(Material!$A$84:$G$85,MATCH(Miljö!E$262,Material!$A$84:$A$85,0),7)*Miljö!E$263,0)","v":0},{"$f":"IF(Miljö!F$260=TRUE,INDEX(Material!$A$84:$G$85,MATCH(Miljö!F$262,Material!$A$84:$A$85,0),7)*Miljö!F$263,0)","v":0},{"$f":"IF(Miljö!G$260=TRUE,INDEX(Material!$A$84:$G$85,MATCH(Miljö!G$262,Material!$A$84:$A$85,0),7)*Miljö!G$263,0)","v":0},{"$f":"IF(Miljö!H$260=TRUE,INDEX(Material!$A$84:$G$85,MATCH(Miljö!H$262,Material!$A$84:$A$85,0),7)*Miljö!H$263,0)","v":0},{"$f":"IF(Miljö!I$260=TRUE,INDEX(Material!$A$84:$G$85,MATCH(Miljö!I$262,Material!$A$84:$A$85,0),7)*Miljö!I$263,0)","v":0},{"$f":"IF(Miljö!J$260=TRUE,INDEX(Material!$A$84:$G$85,MATCH(Miljö!J$262,Material!$A$84:$A$85,0),7)*Miljö!J$263,0)","v":0},{"$f":"IF(Miljö!K$260=TRUE,INDEX(Material!$A$84:$G$85,MATCH(Miljö!K$262,Material!$A$84:$A$85,0),7)*Miljö!K$263,0)","v":0},{"$f":"IF(Miljö!L$260=TRUE,INDEX(Material!$A$84:$G$85,MATCH(Miljö!L$262,Material!$A$84:$A$85,0),7)*Miljö!L$263,0)","v":0}]
["Puts","kWh",{"$f":"IF(Miljö!C$270=TRUE,Material!$G$90*Miljö!C$272,0)","v":0},{"$f":"IF(Miljö!D$270=TRUE,Material!$G$90*Miljö!D$272,0)","v":0},{"$f":"IF(Miljö!E$270=TRUE,Material!$G$90*Miljö!E$272,0)","v":0},{"$f":"IF(Miljö!F$270=TRUE,Material!$G$90*Miljö!F$272,0)","v":0},{"$f":"IF(Miljö!G$270=TRUE,Material!$G$90*Miljö!G$272,0)","v":0},{"$f":"IF(Miljö!H$270=TRUE,Material!$G$90*Miljö!H$272,0)","v":0},{"$f":"IF(Miljö!I$270=TRUE,Material!$G$90*Miljö!I$272,0)","v":0},{"$f":"IF(Miljö!J$270=TRUE,Material!$G$90*Miljö!J$272,0)","v":0},{"$f":"IF(Miljö!K$270=TRUE,Material!$G$90*Miljö!K$272,0)","v":0},{"$f":"IF(Miljö!L$270=TRUE,Material!$G$90*Miljö!L$272,0)","v":0}]
["Gipsskivor","kWh",{"$f":"IF(Miljö!C$279=TRUE,Material!$G$91*Miljö!C$281,0)","v":0},{"$f":"IF(Miljö!D$279=TRUE,Material!$G$91*Miljö!D$281,0)","v":0},{"$f":"IF(Miljö!E$279=TRUE,Material!$G$91*Miljö!E$281,0)","v":0},{"$f":"IF(Miljö!F$279=TRUE,Material!$G$91*Miljö!F$281,0)","v":0},{"$f":"IF(Miljö!G$279=TRUE,Material!$G$91*Miljö!G$281,0)","v":0},{"$f":"IF(Miljö!H$279=TRUE,Material!$G$91*Miljö!H$281,0)","v":0},{"$f":"IF(Miljö!I$279=TRUE,Material!$G$91*Miljö!I$281,0)","v":0},{"$f":"IF(Miljö!J$279=TRUE,Material!$G$91*Miljö!J$281,0)","v":0},{"$f":"IF(Miljö!K$279=TRUE,Material!$G$91*Miljö!K$281,0)","v":0},{"$f":"IF(Miljö!L$279=TRUE,Material!$G$91*Miljö!L$281,0)","v":0}]
["Takbeläggning","kWh",{"$f":"IF(Miljö!C$288=TRUE,INDEX(Material!$A$98:$G$102,MATCH(Miljö!C$290,Material!$A$98:$A$102,0),7)*Miljö!C$291,0)","v":0},{"$f":"IF(Miljö!D$288=TRUE,INDEX(Material!$A$98:$G$102,MATCH(Miljö!D$290,Material!$A$98:$A$102,0),7)*Miljö!D$291,0)","v":0},{"$f":"IF(Miljö!E$288=TRUE,INDEX(Material!$A$98:$G$102,MATCH(Miljö!E$290,Material!$A$98:$A$102,0),7)*Miljö!E$291,0)","v":0},{"$f":"IF(Miljö!F$288=TRUE,INDEX(Material!$A$98:$G$102,MATCH(Miljö!F$290,Material!$A$98:$A$102,0),7)*Miljö!F$291,0)","v":0},{"$f":"IF(Miljö!G$288=TRUE,INDEX(Material!$A$98:$G$102,MATCH(Miljö!G$290,Material!$A$98:$A$102,0),7)*Miljö!G$291,0)","v":0},{"$f":"IF(Miljö!H$288=TRUE,INDEX(Material!$A$98:$G$102,MATCH(Miljö!H$290,Material!$A$98:$A$102,0),7)*Miljö!H$291,0)","v":0},{"$f":"IF(Miljö!I$288=TRUE,INDEX(Material!$A$98:$G$102,MATCH(Miljö!I$290,Material!$A$98:$A$102,0),7)*Miljö!I$291,0)","v":0},{"$f":"IF(Miljö!J$288=TRUE,INDEX(Material!$A$98:$G$102,MATCH(Miljö!J$290,Material!$A$98:$A$102,0),7)*Miljö!J$291,0)","v":0},{"$f":"IF(Miljö!K$288=TRUE,INDEX(Material!$A$98:$G$102,MATCH(Miljö!K$290,Material!$A$98:$A$102,0),7)*Miljö!K$291,0)","v":0},{"$f":"IF(Miljö!L$288=TRUE,INDEX(Material!$A$98:$G$102,MATCH(Miljö!L$290,Material!$A$98:$A$102,0),7)*Miljö!L$291,0)","v":0}]
["Miljöpåverkan avfallshantering, radiatorer","kWh",{"$f":"IF(Miljö!C301=TRUE,    INDEX(Material!$A$146:$G$149, MATCH(Miljö!C303,Material!$A$146:$A$149, 0),7)*Miljö!C304,  0)","v":0},{"$f":"IF(Miljö!D301=TRUE,    INDEX(Material!$A$146:$G$149, MATCH(Miljö!D303,Material!$A$146:$A$149, 0),7)*Miljö!D304,  0)","v":0},{"$f":"IF(Miljö!E301=TRUE,    INDEX(Material!$A$146:$G$149, MATCH(Miljö!E303,Material!$A$146:$A$149, 0),7)*Miljö!E304,  0)","v":0},{"$f":"IF(Miljö!F301=TRUE,    INDEX(Material!$A$146:$G$149, MATCH(Miljö!F303,Material!$A$146:$A$149, 0),7)*Miljö!F304,  0)","v":0},{"$f":"IF(Miljö!G301=TRUE,    INDEX(Material!$A$146:$G$149, MATCH(Miljö!G303,Material!$A$146:$A$149, 0),7)*Miljö!G304,  0)","v":0},{"$f":"IF(Miljö!H301=TRUE,    INDEX(Material!$A$146:$G$149, MATCH(Miljö!H303,Material!$A$146:$A$149, 0),7)*Miljö!H304,  0)","v":0},{"$f":"IF(Miljö!I301=TRUE,    INDEX(Material!$A$146:$G$149, MATCH(Miljö!I303,Material!$A$146:$A$149, 0),7)*Miljö!I304,  0)","v":0},{"$f":"IF(Miljö!J301=TRUE,    INDEX(Material!$A$146:$G$149, MATCH(Miljö!J303,Material!$A$146:$A$149, 0),7)*Miljö!J304,  0)","v":0},{"$f":"IF(Miljö!K301=TRUE,    INDEX(Material!$A$146:$G$149, MATCH(Miljö!K303,Material!$A$146:$A$149, 0),7)*Miljö!K304,  0)","v":0},{"$f":"IF(Miljö!L301=TRUE,    INDEX(Material!$A$146:$G$149, MATCH(Miljö!L303,Material!$A$146:$A$149, 0),7)*Miljö!L304,  0)","v":0}]
["Miljöpåverkan avfallshantering, kopparrör","kWh",{"$f":"IF(Miljö!C311=TRUE,Miljö!C313*Material!$G$155,0)","v":0},{"$f":"IF(Miljö!D311=TRUE,Miljö!D313*Material!$G$155,0)","v":0},{"$f":"IF(Miljö!E311=TRUE,Miljö!E313*Material!$G$155,0)","v":0},{"$f":"IF(Miljö!F311=TRUE,Miljö!F313*Material!$G$155,0)","v":0},{"$f":"IF(Miljö!G311=TRUE,Miljö!G313*Material!$G$155,0)","v":0},{"$f":"IF(Miljö!H311=TRUE,Miljö!H313*Material!$G$155,0)","v":0},{"$f":"IF(Miljö!I311=TRUE,Miljö!I313*Material!$G$155,0)","v":0},{"$f":"IF(Miljö!J311=TRUE,Miljö!J313*Material!$G$155,0)","v":0},{"$f":"IF(Miljö!K311=TRUE,Miljö!K313*Material!$G$155,0)","v":0},{"$f":"IF(Miljö!L311=TRUE,Miljö!L313*Material!$G$155,0)","v":0}]
["Miljöpåverkan avfallshantering, PEX-rör","kWh",{"$f":"IF(Miljö!C320=TRUE,Miljö!C322*Material!$G$156,0)","v":0},{"$f":"IF(Miljö!D320=TRUE,Miljö!D322*Material!$G$156,0)","v":0},{"$f":"IF(Miljö!E320=TRUE,Miljö!E322*Material!$G$156,0)","v":0},{"$f":"IF(Miljö!F320=TRUE,Miljö!F322*Material!$G$156,0)","v":0},{"$f":"IF(Miljö!G320=TRUE,Miljö!G322*Material!$G$156,0)","v":0},{"$f":"IF(Miljö!H320=TRUE,Miljö!H322*Material!$G$156,0)","v":0},{"$f":"IF(Miljö!I320=TRUE,Miljö!I322*Material!$G$156,0)","v":0},{"$f":"IF(Miljö!J320=TRUE,Miljö!J322*Material!$G$156,0)","v":0},{"$f":"IF(Miljö!K320=TRUE,Miljö!K322*Material!$G$156,0)","v":0},{"$f":"IF(Miljö!L320=TRUE,Miljö!L322*Material!$G$156,0)","v":0}]
["Miljöpåverkan avfallshantering, PP-rör","kWh",{"$f":"IF(Miljö!C329=TRUE,Miljö!C331*Material!$G$157,0)","v":0},{"$f":"IF(Miljö!D329=TRUE,Miljö!D331*Material!$G$157,0)","v":0},{"$f":"IF(Miljö!E329=TRUE,Miljö!E331*Material!$G$157,0)","v":0},{"$f":"IF(Miljö!F329=TRUE,Miljö!F331*Material!$G$157,0)","v":0},{"$f":"IF(Miljö!G329=TRUE,Miljö!G331*Material!$G$157,0)","v":0},{"$f":"IF(Miljö!H329=TRUE,Miljö!H331*Material!$G$157,0)","v":0},{"$f":"IF(Miljö!I329=TRUE,Miljö!I331*Material!$G$157,0)","v":0},{"$f":"IF(Miljö!J329=TRUE,Miljö!J331*Material!$G$157,0)","v":0},{"$f":"IF(Miljö!K329=TRUE,Miljö!K331*Material!$G$157,0)","v":0},{"$f":"IF(Miljö!L329=TRUE,Miljö!L331*Material!$G$157,0)","v":0}]
["Miljöpåverkan avfallshantering, järnrör","kWh",{"$f":"IF(Miljö!C338=TRUE,Miljö!C340*Material!$G$158,0)","v":0},{"$f":"IF(Miljö!D338=TRUE,Miljö!D340*Material!$G$158,0)","v":0},{"$f":"IF(Miljö!E338=TRUE,Miljö!E340*Material!$G$158,0)","v":0},{"$f":"IF(Miljö!F338=TRUE,Miljö!F340*Material!$G$158,0)","v":0},{"$f":"IF(Miljö!G338=TRUE,Miljö!G340*Material!$G$158,0)","v":0},{"$f":"IF(Miljö!H338=TRUE,Miljö!H340*Material!$G$158,0)","v":0},{"$f":"IF(Miljö!I338=TRUE,Miljö!I340*Material!$G$158,0)","v":0},{"$f":"IF(Miljö!J338=TRUE,Miljö!J340*Material!$G$158,0)","v":0},{"$f":"IF(Miljö!K338=TRUE,Miljö!K340*Material!$G$158,0)","v":0},{"$f":"IF(Miljö!L338=TRUE,Miljö!L340*Material!$G$158,0)","v":0}]
["Miljöpåverkan avfallshantering, stålrör","kWh",{"$f":"IF(Miljö!C347=TRUE,Miljö!C349*Material!$G$159,0)","v":0},{"$f":"IF(Miljö!D347=TRUE,Miljö!D349*Material!$G$159,0)","v":0},{"$f":"IF(Miljö!E347=TRUE,Miljö!E349*Material!$G$159,0)","v":0},{"$f":"IF(Miljö!F347=TRUE,Miljö!F349*Material!$G$159,0)","v":0},{"$f":"IF(Miljö!G347=TRUE,Miljö!G349*Material!$G$159,0)","v":0},{"$f":"IF(Miljö!H347=TRUE,Miljö!H349*Material!$G$159,0)","v":0},{"$f":"IF(Miljö!I347=TRUE,Miljö!I349*Material!$G$159,0)","v":0},{"$f":"IF(Miljö!J347=TRUE,Miljö!J349*Material!$G$159,0)","v":0},{"$f":"IF(Miljö!K347=TRUE,Miljö!K349*Material!$G$159,0)","v":0},{"$f":"IF(Miljö!L347=TRUE,Miljö!L349*Material!$G$159,0)","v":0}]
["Miljöpåverkan avfallshantering, relining rör","kWh",{"$f":"IF(Miljö!C356=TRUE,Miljö!C358*Material!$G$165,0)","v":0},{"$f":"IF(Miljö!D356=TRUE,Miljö!D358*Material!$G$165,0)","v":0},{"$f":"IF(Miljö!E356=TRUE,Miljö!E358*Material!$G$165,0)","v":0},{"$f":"IF(Miljö!F356=TRUE,Miljö!F358*Material!$G$165,0)","v":0},{"$f":"IF(Miljö!G356=TRUE,Miljö!G358*Material!$G$165,0)","v":0},{"$f":"IF(Miljö!H356=TRUE,Miljö!H358*Material!$G$165,0)","v":0},{"$f":"IF(Miljö!I356=TRUE,Miljö!I358*Material!$G$165,0)","v":0},{"$f":"IF(Miljö!J356=TRUE,Miljö!J358*Material!$G$165,0)","v":0},{"$f":"IF(Miljö!K356=TRUE,Miljö!K358*Material!$G$165,0)","v":0},{"$f":"IF(Miljö!L356=TRUE,Miljö!L358*Material!$G$165,0)","v":0}]
["Miljöpåverkan avfallshantering, elledning","kWh",{"$f":"IF(Miljö!C384=TRUE,Miljö!C386*Material!$G$174,0)","v":0},{"$f":"IF(Miljö!D384=TRUE,Miljö!D386*Material!$G$174,0)","v":0},{"$f":"IF(Miljö!E384=TRUE,Miljö!E386*Material!$G$174,0)","v":0},{"$f":"IF(Miljö!F384=TRUE,Miljö!F386*Material!$G$174,0)","v":0},{"$f":"IF(Miljö!G384=TRUE,Miljö!G386*Material!$G$174,0)","v":0},{"$f":"IF(Miljö!H384=TRUE,Miljö!H386*Material!$G$174,0)","v":0},{"$f":"IF(Miljö!I384=TRUE,Miljö!I386*Material!$G$174,0)","v":0},{"$f":"IF(Miljö!J384=TRUE,Miljö!J386*Material!$G$174,0)","v":0},{"$f":"IF(Miljö!K384=TRUE,Miljö!K386*Material!$G$174,0)","v":0},{"$f":"IF(Miljö!L384=TRUE,Miljö!L386*Material!$G$174,0)","v":0}]
["Miljöpåverkan avfallshantering, Egen elproduktion","kWh",0,0,0,0,0,0,0,0,0,0,"inkl i tillverkningsdata"]
["Total miljöpåverkan avfallshantering","kWh",{"$f":"SUM(C185:C213)","v":0},{"$f":"SUM(D185:D213)","v":0},0,0,0,0,0,0,0,0]
[]
["7.3.4 Total miljöpåverkan under tidsperioden","Negativa värden visar en miljöbesparing jämfört med referensfallet där ingen renovering görs"]
["Total miljöpåverkan, isolering 1","kWh",{"$f":"C145*C5+C185*C5","v":0},0,0,0,0,0,0,0,0,0]
["Total miljöpåverkan, isolering 2","kWh",0,0,0,0,0,0,0,0,0,0]
["Total miljöpåverkan, fasadsystem","kWh",0,0,0,0,0,0,0,0,0,0]
["Total miljöpåverkan, fönster","kWh",0,0,0,0,0,0,0,0,0,0]
["Total miljöpåverkan, dörrar","kWh",0,0,0,0,0,0,0,0,0,0]
["Total miljöpåverkan, byte uppvärmning (material)","kWh",{"$f":"C150*C10+C190*C10+C151*C11","v":0},0,0,0,0,0,0,0,0,0]
["Total miljöpåverkan, cirkulationspump","kWh",{"$f":"C152*C12+C191*C12","v":0},0,0,0,0,0,0,0,0,0]
["Total miljöpåverkan, ventilation (material)","kWh",{"$f":"C153*C13+C192*C13   +C154*C14+C193*C14    +C155*C15+C194*C15","v":0},0,0,0,0,0,0,0,0,0]
["Trä konstruktionsvirke","kWh",{"$f":"C156*C16+C195*C16","v":0},{"$f":"D156*D16+D195*D16","v":0},0,0,0,0,0,0,0,0]
["Trä målad träfasad","kWh",{"$f":"C157*C17+C196*C17","v":0},0,0,0,0,0,0,0,0,0]
["Trä invändig träpanel","kWh",0,0,0,0,0,0,0,0,0,0]
["Betong bjälklag","kWh",0,0,0,0,0,0,0,0,0,0]
["Betong bärande ytterväggar","kWh",0,0,0,0,0,0,0,0,0,0]
["Betong icke-bärande ytterväggar","kWh",0,0,0,0,0,0,0,0,0,0]
["Betong innerväggar","kWh",{"$f":"C162*C22+C201*C22","v":0},0,0,0,0,0,0,0,0,0]
["Puts","kWh",0,0,0,0,0,0,0,0,0,0]
["Gipsskivor","kWh",0,0,0,0,0,0,0,0,0,0]
["Takbeläggning","kWh",0,0,0,0,0,0,0,0,0,0]
["Total miljöpåverkan, radiatorer","kWh",0,0,0,0,0,0,0,0,0,0]
["Total miljöpåverkan, kopparrör","kWh",0,0,0,0,0,0,0,0,0,0]
["Total miljöpåverkan, PEX-rör","kWh",0,0,0,0,0,0,0,0,0,0]
["Total miljöpåverkan, PP-rör","kWh",0,0,0,0,0,0,0,0,0,0]
["Total miljöpåverkan, järnrör","kWh",0,0,0,0,0,0,0,0,0,0]
["Total miljöpåverkan, stålrör","kWh",0,0,0,0,0,0,0,0,0,0]
["Total miljöpåverkan, relining rör","kWh",0,0,0,0,0,0,0,0,0,0]
["Total miljöpåverkan, elledning","kWh",{"$f":"C173*C33+C212*C33","v":0},0,0,0,0,0,0,0,0,0]
["Total miljöpåverkan, egen elproduktion (material)","kWh",0,0,0,0,0,0,0,0,0,0]
["Total miljöpåverkan, drift (värme, kyla, egen elprod)","kWh",{"$f":"C182*Miljö!$C$16","v":{"$error":"#N/A"}},{"$f":"D182*Miljö!$C$16","v":0},{"$f":"E182*Miljö!$C$16","v":0},{"$f":"F182*Miljö!$C$16","v":0},{"$f":"G182*Miljö!$C$16","v":0},{"$f":"H182*Miljö!$C$16","v":0},{"$f":"I182*Miljö!$C$16","v":0},{"$f":"J182*Miljö!$C$16","v":0},{"$f":"K182*Miljö!$C$16","v":0},{"$f":"L182*Miljö!$C$16","v":0}]
["Total miljöpåverkan av renoveringen","kWh",{"$f":"SUM(C217:C244)+Miljö!C397","v":{"$error":"#N/A"}},{"$f":"SUM(D217:D244)+Miljö!D397","v":0},{"$f":"SUM(E217:E244)+Miljö!E397","v":0},{"$f":"SUM(F217:F244)+Miljö!F397","v":0},{"$f":"SUM(G217:G244)+Miljö!G397","v":0},{"$f":"SUM(H217:H244)+Miljö!H397","v":0},{"$f":"SUM(I217:I244)+Miljö!I397","v":0},{"$f":"SUM(J217:J244)+Miljö!J397","v":0},{"$f":"SUM(K217:K244)+Miljö!K397","v":0},{"$f":"SUM(L217:L244)+Miljö!L397","v":0}]
["Pay-back-tid (Primärenergi)","år",{"$f":"-(C175+C214)/C182","v":{"$error":"#N/A"}},{"$error":"#DIV/0!"},{"$error":"#DIV/0!"},{"$error":"#DIV/0!"},{"$error":"#DIV/0!"},{"$error":"#DIV/0!"},{"$error":"#DIV/0!"},{"$error":"#DIV/0!"},{"$error":"#DIV/0!"},{"$error":"#DIV/0!"}]

{"sheet":"Socialt","index":8,"n_rows":144,"n_cols":25,"rows_kept":144,"cut":false,"hidden":false,"merged":[]}
[null,"Social hållbarhetsanalys"]
["Detta blad används för social hållbarhetsanalys."]
[]
[]
["Så här fungerar det:",null,null,"Kort beskrivning av alternativen"]
[null,null,null,"Namn","Info"]
["Diskutera och besvara frågorna (anteckna hur ni har resonerat under rubriken \"Motivering\").",null,null,{"$f":"'Börja här'!Q19","v":"Referensfall"}]
["Reflektera över resultatet och besvara utvärderingsfrågorna.",null,null,{"$f":"IF('Börja här'!Q20=\"\",\"\",'Börja här'!Q20)","v":""}]
[null,null,null,{"$f":"IF('Börja här'!Q21=\"\",\"\",'Börja här'!Q21)","v":""},null,null,null,null,null,null,null,null,null,null,null,"Beräkning"]
[null,null,null,{"$f":"IF('Börja här'!Q22=\"\",\"\",'Börja här'!Q22)","v":""},null,null,null,null,null,null,null,null,null,null,null,"Alt 1","Alt 2","Alt 3","Alt 4","Alt 5","Alt 6","Alt 7","Alt 8","Alt 9","Alt 10"]
[null,null,null,{"$f":"IF('Börja här'!Q23=\"\",\"\",'Börja här'!Q23)","v":""}]
[null,null,null,{"$f":"IF('Börja här'!Q24=\"\",\"\",'Börja här'!Q24)","v":""}]
[null,null,null,{"$f":"IF('Börja här'!Q25=\"\",\"\",'Börja här'!Q25)","v":""}]
[null,null,null,{"$f":"IF('Börja här'!Q26=\"\",\"\",'Börja här'!Q26)","v":""}]
[null,null,null,{"$f":"IF('Börja här'!Q27=\"\",\"\",'Börja här'!Q27)","v":""}]
[null,null,null,{"$f":"IF('Börja här'!Q28=\"\",\"\",'Börja här'!Q28)","v":""}]
["Resultat"]
[]
[null,null,null,null,{"$f":"D7","v":"Referensfall"},{"$f":"IF(D8=\"\",\"\",D8)","v":""},{"$f":"IF(D9=\"\",\"\",D9)","v":""},{"$f":"IF(D10=\"\",\"\",D10)","v":""},{"$f":"IF(D11=\"\",\"\",D11)","v":""},{"$f":"IF(D12=\"\",\"\",D12)","v":""},{"$f":"IF(D13=\"\",\"\",D13)","v":""},{"$f":"IF(D14=\"\",\"\",D14)","v":""},{"$f":"IF(D15=\"\",\"\",D15)","v":""},{"$f":"IF(D16=\"\",\"\",D16)","v":""}]
[null,null,null,"1. Insatser utomhus",{"$f":"IF(SUM(P48:P78)=0,\"0\",SUM(P48:P78))","v":-11},{"$f":"IF(SUM(Q48:Q78)=0,\"0\",SUM(Q48:Q78))","v":-11},{"$f":"IF(SUM(R48:R78)=0,\"0\",SUM(R48:R78))","v":-11},-11,-11,-11,-11,-11,-11,-11]
[null,null,null,"1.1. Friyta",{"$f":"IF(SUM(P48:P49)=0,\"0\",SUM(P48:P49))","v":-6},{"$f":"IF(SUM(Q42:Q47)=0,\"0\",SUM(Q42:Q47))","v":-6},-6,-6,-6,-6,-6,-6,-6,-6]
[null,null,null,"1.2 Rumslig utformning",{"$f":"IF(SUM(P50:P51)=0,\"0\",SUM(P50:P51))","v":-1},-1,-1,-1,-1,-1,-1,-1,-1,-1]
[null,null,null,"1.3 Växtlighet och topografi",{"$f":"IF(SUM(P57:P58)=0,\"0\",SUM(P57:P58))","v":-1},-1,-1,-1,-1,-1,-1,-1,-1,-1]
[null,null,null,"1.4 Lek, umgänge och vila",{"$f":"IF(SUM(P63:P64)=0,\"0\",SUM(P63:P64))","v":-1},-1,-1,-1,-1,-1,-1,-1,-1,-1]
[null,null,null,"1.5 Lärande i utemiljö",{"$f":"IF(SUM(P71:P72)=0,\"0\",SUM(P71:P72))","v":-1},-1,-1,-1,-1,-1,-1,-1,-1,-1]
[null,null,null,"1.6 Material och uthållighet",{"$f":"IF(SUM(P78:P79)=0,\"0\",SUM(P78:P79))","v":-1},-1,-1,-1,-1,-1,-1,-1,-1,-1]
[null,null,null,"2. Insatser inomhus",{"$f":"IF(SUM(P88:P110)=0,\"0\",SUM(P88:P110))","v":-4},{"$f":"IF(SUM(Q87:Q110)=0,\"0\",SUM(Q87:Q110))","v":-4},-4,-4,-4,-4,-4,-4,-4,-4]
[null,null,null,"2.1 Material och miljö",{"$f":"IF(SUM(P88:P89)=0,\"0\",SUM(P88:P89))","v":-1},{"$f":"IF(SUM(Q88:Q89)=0,\"0\",SUM(Q88:Q89))","v":-1},{"$f":"IF(SUM(R88:R89)=0,\"0\",SUM(R88:R89))","v":-1},{"$f":"IF(SUM(S88:S89)=0,\"0\",SUM(S88:S89))","v":-1},{"$f":"IF(SUM(T88:T89)=0,\"0\",SUM(T88:T89))","v":-1},-1,-1,-1,-1,-1]
[null,null,null,"2.2 Rumslig utformning",{"$f":"IF(SUM(P96:P97)=0,\"0\",SUM(P96:P97))","v":-1},{"$f":"IF(SUM(Q95:Q96)=0,\"0\",SUM(Q95:Q96))","v":-1},{"$f":"IF(SUM(R95:R96)=0,\"0\",SUM(R95:R96))","v":-1},{"$f":"IF(SUM(S95:S96)=0,\"0\",SUM(S95:S96))","v":-1},{"$f":"IF(SUM(T95:T96)=0,\"0\",SUM(T95:T96))","v":-1},{"$f":"IF(SUM(U95:U96)=0,\"0\",SUM(U95:U96))","v":-1},-1,-1,{"$f":"IF(SUM(X95:X96)=0,\"0\",SUM(X95:X96))","v":-1},{"$f":"IF(SUM(Y95:Y96)=0,\"0\",SUM(Y95:Y96))","v":-1}]
[null,null,null,"2.3 Samspel med naturen",{"$f":"IF(SUM(P104:P105)=0,\"0\",SUM(P104:P105))","v":-1},{"$f":"IF(SUM(Q104:Q105)=0,\"0\",SUM(Q104:Q105))","v":-1},{"$f":"IF(SUM(R104:R105)=0,\"0\",SUM(R104:R105))","v":-1},{"$f":"IF(SUM(S104:S105)=0,\"0\",SUM(S104:S105))","v":-1},{"$f":"IF(SUM(T104:T105)=0,\"0\",SUM(T104:T105))","v":-1},-1,-1,-1,-1,-1]
[null,null,null,"2.4 Ägandeskap och stimulans",{"$f":"IF(SUM(P110:P111)=0,\"0\",SUM(P110:P111))","v":-1},{"$f":"IF(SUM(Q110:Q111)=0,\"0\",SUM(Q110:Q111))","v":-1},{"$f":"IF(SUM(R110:R111)=0,\"0\",SUM(R110:R111))","v":-1},{"$f":"IF(SUM(S110:S111)=0,\"0\",SUM(S110:S111))","v":-1},{"$f":"IF(SUM(T110:T111)=0,\"0\",SUM(T110:T111))","v":-1},-1,-1,-1,-1,-1]
[null,null,null,"Summa",{"$f":"IF(E19=\"\",\"\",E20+E27)","v":-15},{"$f":"IF(F19=\"\",\"\",F20+F27)","v":""},"",{"$f":"IF(H19=\"\",\"\",H20+H27)","v":""},"",{"$f":"IF(J19=\"\",\"\",J20+J27)","v":""},"","",{"$f":"IF(M19=\"\",\"\",M20+M27)","v":""},""]
[]
[]
["Utvärderingsfråga:","Information:","Viktning","Svar:"]
["Ger de olika alternativen olika resultat och i så fall varför? ","Ta hjälp av stapeldiagrammet (ovan till vänster) för att utläsa poäng som givits per renoveringsalternativ. Se tabellen (ovan till höger) för att utläsa hur många poäng som tilldelats varje underkategori. "]
["Finns det någonting mer ni kan åtgärda? Om ja, hur? ","Tänk på: insatser av olika slag kan ge olika mycket plus- och minuspoäng, eftersom det läggs extra stor vikt vid vissa insatser i forskningen."]
["Har ni behövt göra prioriteringar under arbetets gång? Om ja, hur har ni motiverat dessa?"]
["1. Insatser utomhus"]
["1.1 Friyta","Friyta är den yta som barn kan använda på egen hand vid utevistelse och lek. Till exempel så räknas basketplaner, gräsplättar och kullar men inte förrådsbyggnader, bil- och cykelparkering samt ytor för lastning. (Boverket & Movium 2015)"]
["Fråga","Bakgrundsinformation","Viktning","Motivering:",{"$f":"D7","v":"Referensfall"},{"$f":"IF(D8=\"\",\"\",D8)","v":""},{"$f":"IF(D9=\"\",\"\",D9)","v":""},{"$f":"IF(D10=\"\",\"\",D10)","v":""},{"$f":"IF(D11=\"\",\"\",D11)","v":""},{"$f":"IF(D12=\"\",\"\",D12)","v":""},{"$f":"IF(D13=\"\",\"\",D13)","v":""},{"$f":"IF(D14=\"\",\"\",D14)","v":""},{"$f":"IF(D15=\"\",\"\",D15)","v":""},{"$f":"IF(D16=\"\",\"\",D16)","v":""}]
["Har er skolgård en friyta större än 2000 m2?","En stor yta medför minskat slitage, möjlighet till variation i utemiljön och möjliggör platskrävande lek. (Crawley 2016; Malmö stad 2011b)","ja: 1, nej: -3",null,false,false,false,false,false,false,false,false,false,false,null,{"$f":"IF(E42=TRUE,1,-3)","v":-3},{"$f":"IF(F42=TRUE,1,-3)","v":-3},-3,-3,-3,-3,-3,-3,-3,-3]
["Har er skolgård en friyta större än 3000 m2?","Forskning visar att friytan helst bör överstiga 3000m2, annars får barn svårt att utveckla lek och socialt samspel, oavsett antal barn. (Boverket & Movium 2015; Mårtensson 2013)","ja: 1, nej: 0",null,false,false,false,false,false,false,false,false,false,false,null,{"$f":"IF(E43=TRUE,1,0)","v":0},{"$f":"IF(F43=TRUE,1,0)","v":0},0,0,0,0,0,0,0,0]
["Finns det minst 30 m2 friyta per barn?","Storleken på friytan ska även vara tillräckligt för det antal barn som går på skolan.  (Crawley 2016; Malmö stad 2011b)","ja: 1, nej: -1",null,false,false,false,false,false,false,false,false,false,false,null,{"$f":"IF(E44=TRUE,1,-1)","v":-1},{"$f":"IF(F44=TRUE,1,-1)","v":-1},-1,-1,-1,-1,-1,-1,-1,-1]
["Finns det minst 40 m2 friyta per barn?","40 m2 friyta per barn är eftersträvansvärt. (Isaksson et al 2013; Boverket & Movium 2015; Lenninger 2014)","ja: 1, nej: 0",null,false,false,false,false,false,false,false,false,false,false,null,{"$f":"IF(E45=TRUE,1,0)","v":0},{"$f":"IF(F45=TRUE,1,0)","v":0},0,0,0,0,0,0,0,0]
["Ligger skolgården i direkt anslutning till skolbyggnaden/-erna?","Till exempel bör skolgården inte vara skiljd från skolan genom vägar eller dylikt. Studier har visat att elever med egen tillgång till friytan är mer fysiskt aktiva, och är bättre på att lösa konflikter självständigt. (Nordström 2014)","ja: 1, nej: -1",null,false,false,false,false,false,false,false,false,false,false,null,{"$f":"IF(E46=TRUE,1,-1)","v":-1},-1,-1,-1,-1,-1,-1,-1,-1,-1]
["Är det skolgårdens ljudmiljö på lagom nivå?","Bullriga miljöer har en negativ påverkan på barns utveckling, lärande, sociala relationer och hälsa. I SFS 2015:216 riktlinjer för ljudnivå från spårtrafik och väg ska medelljudnivån inte överstiga 50 dBA. Exempel på ljudnivåer i dBA: viskning = 40, samtalston = 60 och stadstrafik med fordon/skolmatsal = 80. (Malmö stad 2011a; Boverket & Movium 2015; Umeå kommun 2017)","ja: 1, nej: -1",null,false,false,false,false,false,false,false,false,false,false,null,-1,-1,-1,-1,-1,-1,-1,-1,-1,-1]
["1.2 Rumslig utformning",null,null,null,null,null,null,null,null,null,null,null,null,null,"summa friyta",{"$f":"SUM(P42:P47)","v":-6},{"$f":"SUM(Q42:Q47)","v":-6},-6,-6,-6,-6,-6,-6,-6,-6]
["Fråga","Bakgrundsinformation","Viktning","Motivering:",{"$f":"D7","v":"Referensfall"},{"$f":"IF(D8=\"\",\"\",D8)","v":""},{"$f":"IF(D9=\"\",\"\",D9)","v":""},{"$f":"IF(D10=\"\",\"\",D10)","v":""},{"$f":"IF(D11=\"\",\"\",D11)","v":""},{"$f":"IF(D12=\"\",\"\",D12)","v":""},{"$f":"IF(D13=\"\",\"\",D13)","v":""},{"$f":"IF(D14=\"\",\"\",D14)","v":""},{"$f":"IF(D15=\"\",\"\",D15)","v":""},{"$f":"IF(D16=\"\",\"\",D16)","v":""}]
["Uppfyller friytan en variation i typer av miljöer, med minst tre eller fler miljöer av varierande karaktär i utemiljön? Använd diskussionsfrågorna nedan för att svara på denna fråga:","Barns behov ser olika ut, en mångfald av olika miljöer behövs för att tillgodose dessa samt möjliggöra utveckling. Helst inga barriärer mellan de olika miljöerna, då de hindrar lekens flöde. (Isaksson et al 2013)","Ja: 1, nej: -1",null,false,false,false,false,false,false,false,false,false,false,null,{"$f":"IF(E50=TRUE,1,-1)","v":-1},{"$f":"IF(F50=TRUE,1,-1)","v":-1},{"$f":"IF(G50=TRUE,1,-1)","v":-1},{"$f":"IF(H50=TRUE,1,-1)","v":-1},{"$f":"IF(I50=TRUE,1,-1)","v":-1},-1,-1,-1,-1,-1]
["• Finns det en trygg miljö nära skolbyggnaden, med möjlighet till god översikt?","För känsla av trygghet, samvaro och återhämtning,  samt överblick för pedagoger. (Crawley 2016; Malmö stad 2011b; Isaksson et al 2013)"]
["• Finns det en miljö med utrymme för platskrävande och dynamisk lek?","En yta med utrymme för vidlyftig lek ska möjliggöra lek där barnen kan få upp fart, där överblick är en viktig grundläggande faktor, och möjliggöra rörelse mellan olika aktiviteter. Denna typ av yta är viktig för den fysiska aktiviteten och möjligheten till rörelse (Crawley 2016; Malmö stad 2011b; Isaksson et al 2013; Mårtensson 2013). "]
["• Finns det en miljö som genom växtlighet, höjdskillnader eller liknande kan upplevas som vild och utmanande, med kryp-in att dra sig undan i eller träd att klättra i?","Variation i höjdskillnader och växtlighet påverkar barns motoriska egenskaper positivt, ger möjlighet till rekreationsplatser, och uppmuntrar till kreativ lek. (Crawley 2016)  "]
["• Finns det  en eller flera andra typer av miljöer som inte tillhör någon av dem som beskrivs ovan?","Andra typer av miljöer än de tidigare nämnda är exempelvis miljöer avsatta för en specifik typ av aktivitet, så som sportplaner, lärandeytor, vattenytor och odlingslotter."]
["1.3 Växtlighet och topografi"]
["Fråga","Bakgrundsinformation","Viktning","Motivering:",{"$f":"D7","v":"Referensfall"},{"$f":"IF(D8=\"\",\"\",D8)","v":""},{"$f":"IF(D9=\"\",\"\",D9)","v":""},{"$f":"IF(D10=\"\",\"\",D10)","v":""},{"$f":"IF(D11=\"\",\"\",D11)","v":""},{"$f":"IF(D12=\"\",\"\",D12)","v":""},{"$f":"IF(D13=\"\",\"\",D13)","v":""},{"$f":"IF(D14=\"\",\"\",D14)","v":""},{"$f":"IF(D15=\"\",\"\",D15)","v":""},{"$f":"IF(D16=\"\",\"\",D16)","v":""}]
["Finns det en variation i växtlighet och topografi i utemiljön? Använd diskussionsfrågorna nedan för att svara på denna fråga:","En utemiljö med variation kan gynna barnens fysiska aktivtet, kreativitet och utveckling. Att ta hänsyn till och bevara befintlig terräng kan vara gynnsamt, då nyetablering av växter tar tid samt skogsdungar och andra naturtyper är svåra att efterhärma. (Mårtensson 2013; Boverket & Movium 2015)","Ja: 1, nej: -1",null,false,false,false,false,false,false,false,false,false,false,null,{"$f":"IF(E57=TRUE,1,-1)","v":-1},{"$f":"IF(F57=TRUE,1,-1)","v":-1},{"$f":"IF(G57=TRUE,1,-1)","v":-1},{"$f":"IF(H57=TRUE,1,-1)","v":-1},{"$f":"IF(I57=TRUE,1,-1)","v":-1},-1,-1,-1,-1,-1]
["• Finns det höjdskillnader, så som kullar, sänkor och slänter i utemiljön?","Höjdvariationer är bra för fysisk aktivitet och motorik. (Crawley 2016; Malmö stad 2011b; Boverket & Movium 2015) "]
["• Finns det en variation i typen av växtlighet, med planteringar och gräsmattor, så väl som naturrika inslag som buskage och träd?","Naturrika gårdar är bättre för fysisk akivitet, och barns motoriska, mentala och sociala färdigheter. Ger även tillälle till kreativ lek. Ur detta perspektiv är tåliga och mysiga buskage och skogsbryn bättre än prydnadsvegetation. (Crawley 2016; Malmö stad 2011b; Boverket & Movium 2015; Statens folkhälsoinstitut 2013) "]
["• Finns det möjlighet att vistas i skugga så väl som i sol?","Barnen behöver en bra balans mellan sol och skugga, för återhämtning och hälsa. Växtlighet kan ge skydd för väder och vind. (Crawley 2016; Malmö stad 2011b; Boverket & Movium 2015) "]
["1.4 Lek, umgänge och vila"]
["Fråga","Bakgrundsinformation","Viktning","Motivering:",{"$f":"D7","v":"Referensfall"},{"$f":"IF(D8=\"\",\"\",D8)","v":""},{"$f":"IF(D9=\"\",\"\",D9)","v":""},{"$f":"IF(D10=\"\",\"\",D10)","v":""},{"$f":"IF(D11=\"\",\"\",D11)","v":""},{"$f":"IF(D12=\"\",\"\",D12)","v":""},{"$f":"IF(D13=\"\",\"\",D13)","v":""},{"$f":"IF(D14=\"\",\"\",D14)","v":""},{"$f":"IF(D15=\"\",\"\",D15)","v":""},{"$f":"IF(D16=\"\",\"\",D16)","v":""}]
["Finns det en mångfald av platser för lek, umgänge och vila, inom olika typer av miljöer och för olika behov? Använd diskussionsfrågorna nedan för att svara på denna fråga:     ","En god utemiljö innehar många s.k. miljöerbjudanden som ger barnen möjlighet att hoppa, kana, klättra och springa, för att uppfylla barnens behov av lek och rörelse. Tänk på att  barn har olika behov och förutsättningar. (Mårtesson 2013)","Ja: 1, nej: -1",null,false,false,false,false,false,false,false,false,false,false,null,{"$f":"IF(E63=TRUE,1,-1)","v":-1},{"$f":"IF(F63=TRUE,1,-1)","v":-1},{"$f":"IF(G63=TRUE,1,-1)","v":-1},{"$f":"IF(H63=TRUE,1,-1)","v":-1},{"$f":"IF(I63=TRUE,1,-1)","v":-1},-1,-1,-1,-1,-1]
["• Är lekutrutrustningen integrerad och utspridd i utemiljön?","Lekutrustningen bör inte vara samlad till en eller ett fåtal ytor. All lekutrustning bör inte finnas inom inramade områden, utan gärna integreras bland växtlighet. Hellre ett flertal små lekredskap än ett stort. (Crawley 2016; Malmö stad 2011b; Isaksson 2013; Mårtensson 2013) "]
["• Finns det partier eller inslag av växtlighet på gården som kan användas för lek eller umgänge?","Att kunna använda höjdskillnader eller växtlighet för klättring, balansgång och annan aktivitet skapar nya förutsättningar för lek. Stockar är ett naturligt inslag som enkelt kan bidra med variation och möjliga umgängesplatser. (Crawley 2016; Malmö stad 2011b; Boverket & Movium 2015) "]
["• Finns det sittplatser, så som bänkar, trappor eller trädäck som kan fungera som hängplatser för äldre barn?","Skapar förutsättningar för socialt samspel och impulser till rörelse. (Boverket & Movium 2015)"]
["• Finns det speciella platser skräddarsydda för en viss typ av aktivitet, så som lärandemiljöer eller platser för kreativt skapande?","Platser för aktiviteter så som vattenlekar, verkstad, scener och berättarplatser ökar gårdens attraktivitet och kan fungera som en igångsättare för lek och lärande. Möjlighet att utrycka sin identitet är viktigt framförallt för äldre barn. (Boverket & Movium 2015) "]
["• Finns det stilla platser för vila och återhämtning?","Genomsiktlig grönska är att föredra framför slutna utrymmen, för att möjliggöra en viss grad av insyn för de vuxna samt motverka mobbning. Dessa platser kan vara extra betydelsefulla för personer med behov att dra sig undan och återhämta sig. Platser av detta slag kan med fördel placeras både nära och längre bort från skolbyggnaden. (Boverket & Movium 2015) "]
["1.4 Lärande i utemiljön"]
["Fråga","Bakgrundsinformation","Viktning","Motivering:",{"$f":"D7","v":"Referensfall"},{"$f":"IF(D8=\"\",\"\",D8)","v":""},{"$f":"IF(D9=\"\",\"\",D9)","v":""},{"$f":"IF(D10=\"\",\"\",D10)","v":""},{"$f":"IF(D11=\"\",\"\",D11)","v":""},{"$f":"IF(D12=\"\",\"\",D12)","v":""},{"$f":"IF(D13=\"\",\"\",D13)","v":""},{"$f":"IF(D14=\"\",\"\",D14)","v":""},{"$f":"IF(D15=\"\",\"\",D15)","v":""},{"$f":"IF(D16=\"\",\"\",D16)","v":""}]
["Uppmuntrar och möjliggör utomhusmiljön barns lärande? Använd diskussionsfrågorna nedan för att svara på denna fråga:",null,"Ja: 1, nej: -1",null,false,false,false,false,false,false,false,false,false,false,null,{"$f":"IF(E71=TRUE,1,-1)","v":-1},{"$f":"IF(F71=TRUE,1,-1)","v":-1},{"$f":"IF(G71=TRUE,1,-1)","v":-1},{"$f":"IF(H71=TRUE,1,-1)","v":-1},{"$f":"IF(I71=TRUE,1,-1)","v":-1},-1,-1,-1,-1,-1]
["• Kan inomhusverksamheten på ett enkelt sätt flytta ut, finns det exempelvis ytor i utemiljön som kan fungera för lärande och möblemang för det? ","Växelverkan mellan lärande ute och inne främjar ett variationsrikt lärande och stimulerar barns tänkande, motivation och hälsa. Främjar även kreativitet hos pedagoger.  (Szczepanski 2014; Boverket & Movium 2015; Crawley 2016; Malmö stad 2011) "]
["• Finns det en mångfald i utemiljön, genom olika biotoper, stenarter och ett varierat växt- och djurliv? ","Mångfald i skolans utemiljö ger möjlighet för olika intryck och sinnesupplevelser för barnen, samt möjlighet till lärande. Barnen kan då lära sig om naturen baserat på observationer av verkligheten. (Szczepanski 2014; Boverket & Movium 2015; Crawley 2016; Malmö stad 2011)"]
["• Finns det på gården tillgång till löst material så som pinnar, kottar, sand och stenar, och snö under vintern, som kan användas för lek och lärande?  ","Löst material främjar konstruktionslekar och kreativiteten. Det lösa materialet får gärna vara av naturmaterial. (Crawley 2016; Malmö stad 2011b; Boverket & Movium; Logan 2016; Mårtensson 2013)"]
["• Finns det möjlighet för barnen att lära sig om naturvetenskapliga fenomen, så som årstider, livscyckler och kretslopp?","Odlingar, dagvattenhantering (exempelvis rännor, slussar, och pumpar) och komposter är exempel på aktiviter där barnen kan få ökad omvärldsförståelse. Att observera fenomenen i verkligheten främjar även barnens förståelse för fenomenet.  (Crawley 2016; Malmö stad 2011b; Scczepanski 2014; Boverket & Movium 2015) "]
["1.5 Underhåll och uthållighet"]
["Fråga","Bakgrundsinformation","Viktning","Motivering:",{"$f":"D7","v":"Referensfall"},{"$f":"IF(D8=\"\",\"\",D8)","v":""},{"$f":"IF(D9=\"\",\"\",D9)","v":""},{"$f":"IF(D10=\"\",\"\",D10)","v":""},{"$f":"IF(D11=\"\",\"\",D11)","v":""},{"$f":"IF(D12=\"\",\"\",D12)","v":""},{"$f":"IF(D13=\"\",\"\",D13)","v":""},{"$f":"IF(D14=\"\",\"\",D14)","v":""},{"$f":"IF(D15=\"\",\"\",D15)","v":""},{"$f":"IF(D16=\"\",\"\",D16)","v":""}]
["Är utemiljön välskött och uthållig på såväl kort som lång sikt? Använd diskussionsfrågorna nedan för att svara på denna fråga:",null,"ja: 1, nej: -1",null,false,false,false,false,false,false,false,false,false,false,null,{"$f":"IF(E78=TRUE,1,-1)","v":-1},{"$f":"IF(F78=TRUE,1,-1)","v":-1},{"$f":"IF(G78=TRUE,1,-1)","v":-1},{"$f":"IF(H78=TRUE,1,-1)","v":-1},{"$f":"IF(I78=TRUE,1,-1)","v":-1},-1,-1,-1,-1,-1]
["• Är existerande lekredskap och övrigt möblemang i god kondition? ","Lekredskap och annat möblemang ska vara rena, hela och ofarliga för att hindra skador samt uppmuntra till lek. (Boverket & Movium 2015) "]
["• Är vegetationen och friytan välskött, städad och lättunderhållen?","Utemiljön utsätts ofta för hårt slitage vilket är viktigt att ta hänsyn till båda i utformning av utemiljön och vid underhåll. Skötsel av växtlighet bör anpassas till barns ögonhöjd, lågt sittande grenverk möjliggör observation av blad och grenar samt kan uppmuntra till lek. Platser som lockar barn till lek, såsom rishögar och vattenansamlingar bör så långt som möjligt behållas. (Boverket & Movium 2015)"]
["• Är materialen och växtligheten i utemiljön utformade för att motstå slitage och hålla över tid?","Den långsiktiga uthålligheten av utemiljön är ofta underprioriterat i sådana här sammanhang (Dempsey et al 2012)"]
["• Finns det resurser för att underhålla utemiljön?","Den långsiktiga hanteringen och finansieringen av utemiljön är ofta underprioriterat i sådana här sammanhang (Dempsey et al 2012)"]
["• Är utemiljön anpassad för att hålla och underhållas utefter rådande klimat?","Om material och konstruktion inte utformas efter klimatet kan det tänkas uppstå problem med exempelvis stora vattensamlingar på en fotbollsplan eller med ramper som är för smala för att kunna skottas. "]
[]
["2. Insatser inomhus"]
["2.1 Material och miljö"]
["Fråga","Bakgrundsinformation","Viktning","Motivering:",{"$f":"D7","v":"Referensfall"},{"$f":"IF(D8=\"\",\"\",D8)","v":""},{"$f":"IF(D9=\"\",\"\",D9)","v":""},{"$f":"IF(D10=\"\",\"\",D10)","v":""},{"$f":"IF(D11=\"\",\"\",D11)","v":""},{"$f":"IF(D12=\"\",\"\",D12)","v":""},{"$f":"IF(D13=\"\",\"\",D13)","v":""},{"$f":"IF(D14=\"\",\"\",D14)","v":""},{"$f":"IF(D15=\"\",\"\",D15)","v":""},{"$f":"IF(D16=\"\",\"\",D16)","v":""}]
["Har lokalerna ett gynnsamt klimat för lärande och vistelse? Använd diskussionsfrågorna nedan för att svara på denna fråga:",null,"Ja: 1, nej: -1",null,false,false,false,false,false,false,false,false,false,false,null,{"$f":"IF(E88=TRUE,1,-1)","v":-1},{"$f":"IF(F88=TRUE,1,-1)","v":-1},{"$f":"IF(G88=TRUE,1,-1)","v":-1},{"$f":"IF(H88=TRUE,1,-1)","v":-1},{"$f":"IF(I88=TRUE,1,-1)","v":-1},-1,-1,-1,-1,{"$f":"IF(N88=TRUE,1,-1)","v":-1}]
["• Har verksamhetsrummen tillgång till adekvat ljus?","Naturligt ljus är att föredra, och bör kompletteras med kvalitativt konstgjort ljus vid behov. Fönstren bör även vara utrustade med externa solskydd, för att ge bättre undervisningsmiljö. (Barrett et al 2015; Plotka 2016; Westholm & Rydsjö 2015) "]
["• Har lokalerna en god luftkvalitet?","Öppningsbara fönster, högt i tak och god ventilation är viktiga för en god luftkvalitet.(Barrett et al 2015; Plotka 2016)"]
["• Har lokalerna en bra ljudnivå?","Material och rumsutformning bidrar till att påverka ljudnivåer. (Barrett et al 2015; Plotka 2016) "]
["• Har lokalerna en god temperatur?","En sval temperatur är bättre för effektivt lärande. Klimatanläggningen ska vara enkel att använda och kunna anpassas till vilken aktivitet som rummet används till. (Barrett et al 2015; Plotka 2016)"]
["• Är lokaler och material lätt att sköta och hålla rent?","En god renhållning är viktig för barns hälsa, trivsel och känsla av värde. (Folkhälsomyndigheten 2015; de Laval 2010)"]
["2.2 Rumslig utformning"]
["Fråga","Bakgrundsinformation","Viktning","Motivering:",{"$f":"D7","v":"Referensfall"},{"$f":"IF(D8=\"\",\"\",D8)","v":""},{"$f":"IF(D9=\"\",\"\",D9)","v":""},{"$f":"IF(D10=\"\",\"\",D10)","v":""},{"$f":"IF(D11=\"\",\"\",D11)","v":""},{"$f":"IF(D12=\"\",\"\",D12)","v":""},{"$f":"IF(D13=\"\",\"\",D13)","v":""},{"$f":"IF(D14=\"\",\"\",D14)","v":""},{"$f":"IF(D15=\"\",\"\",D15)","v":""},{"$f":"IF(D16=\"\",\"\",D16)","v":""}]
["Fyller den rumsliga utformningen de funktioner som behövs för en gynnsam lärandemiljö? Använd diskussionsfrågorna nedan för att svara på denna fråga:","Flexibilitet i verksamhetsrummen är viktigt för att möjliggöra anpassning till olika typer av aktiviteter och undervisning. ","Ja: 1, nej: -1",null,false,false,false,false,false,false,false,false,false,false,null,{"$f":"IF(E96=TRUE,1,-1)","v":-1},{"$f":"IF(F96=TRUE,1,-1)","v":-1},{"$f":"IF(G96=TRUE,1,-1)","v":-1},{"$f":"IF(H96=TRUE,1,-1)","v":-1},{"$f":"IF(I96=TRUE,1,-1)","v":-1},-1,-1,-1,-1,-1]
["• Är det möjligt att skapa olika aktivitetsområden i klassrummen?","Flexibla eller varierade klassrum är viktigt eftersom mindre barn har behov av mer zonering i rummen än äldre barn. Yngre barn lär sig i högre utsträckning genom lek medan äldre barns undervisning oftare kräver homogena rum. (Barrett et al 2015; Plotka 2016) "]
["• Finns det verksamhetsytor (utöver klassrum) med hård funktionalitet, det vill säga rum med specifika användningsområden?","Funktionaliten hos rum fungerar beteendestyrande, genom att uppmuntra eller begränsa barnens beteende och aktiviteter. Exempel på rum med hård funktionalitet kan vara bibliotek, idrottshall och slöjdsal. (de Laval 2010)"]
["• Finns det verksamhetsrum (utöver klassrum) med mjuk funktionalitet, det vill säga rum med möjligheter till mångsidig användning?","Möjliggörande av olika aktiviteter uppmuntrar kreativiteten. Flexibilitet behövs för att facilitera olika typer av undervisning, såsom projektarbeten i grupp. Hjälpmedel på plats som möjliggör flexibilitet och olika användningsområden. (de Laval 2010; Plotka 2016)"]
["• Finns det gemensamma ytor som möjliggör möten mellan olika åldersgrupper eller klasser?","Samlingslokaler som bibliotek och \"torg\" kan fungera som mötesplatser för alla som vistas på skolan och kan användas för pedagogiskt kreativa projekt, speciellt vid en stor mängd klasser och avdelningar. (de Laval 2010; Westholm & Rydsjö 2015) "]
["• Finns det ytor som kan användas som timeout-rum och/eller vilorum i anslutning till klassrummen?","Timeout-rum kan behövas i det pedagogiska arbetet för att skapa ordning, samt för barnens återhämtning. Kan även användas för gruppaktiviteter och enskilt stöd. (Barrett et al 2015)"]
["2.3 Samspel med naturen"]
["Fråga","Bakgrundsinformation","Viktning","Motivering:",{"$f":"D7","v":"Referensfall"},{"$f":"IF(D8=\"\",\"\",D8)","v":""},{"$f":"IF(D9=\"\",\"\",D9)","v":""},{"$f":"IF(D10=\"\",\"\",D10)","v":""},{"$f":"IF(D11=\"\",\"\",D11)","v":""},{"$f":"IF(D12=\"\",\"\",D12)","v":""},{"$f":"IF(D13=\"\",\"\",D13)","v":""},{"$f":"IF(D14=\"\",\"\",D14)","v":""},{"$f":"IF(D15=\"\",\"\",D15)","v":""},{"$f":"IF(D16=\"\",\"\",D16)","v":""}]
["Finns det ett samspel mellan utomhusmiljön och inomhusmiljön? Använd diskussionsfrågorna nedan för att svara på denna fråga:","Ett gott samspel mellan utomhusmiljö och inomhusmiljö har goda fysiska effekter då det ökar barns möjlighet att vara aktiva, samtidigt som inslag av natur skapar en lugnare och mer avslappnad inomhusmiljö. ","Ja: 1, nej: -1",null,false,false,false,false,false,false,false,false,false,false,null,{"$f":"IF(E104=TRUE,1,-1)","v":-1},{"$f":"IF(F104=TRUE,1,-1)","v":-1},{"$f":"IF(G104=TRUE,1,-1)","v":-1},{"$f":"IF(H104=TRUE,1,-1)","v":-1},{"$f":"IF(I104=TRUE,1,-1)","v":-1},-1,-1,-1,-1,{"$f":"IF(N104=TRUE,1,-1)","v":-1}]
["• Finns det direkt tillgång till utomhusmiljön från verksamhetsrummen för barn och pedagoger?","Ökad tillgång till utomhusmiljön ökar den fysiska aktiviteten. (Pålsson 2010; Barrett et al 2015) "]
["• Kan barnen uppleva grönska inifrån verksamhetsrummen, exempelvis genom utsikt över grönska och växtlighet?","Fönstren ska fördelaktigen ha utsikt över naturliga element och vara stora och lågt placerade för att underlätta överblickbarheten över utemiljön för barnen. (Barrett et al 2015; Pålsson 2010)"]
["• Finns det inslag av natur i verksamhetsrummen, såsom inomhusrabatter och krukväxter?","Grönska ökar återhämtning och koncentrationsförmågan, samt reducerar stress. (Barrett et al 2015) Tänk på att växtligheten ska fungera för personer med astma och allergi, se Astma- och allergiförbundets hemsida för tips om bra växtval. "]
["2.4 Ägandeskap och visuell stimulans"]
["Fråga","Bakgrundsinformation","Viktning","Motivering:",{"$f":"D7","v":"Referensfall"},{"$f":"IF(D8=\"\",\"\",D8)","v":""},{"$f":"IF(D9=\"\",\"\",D9)","v":""},{"$f":"IF(D10=\"\",\"\",D10)","v":""},{"$f":"IF(D11=\"\",\"\",D11)","v":""},{"$f":"IF(D12=\"\",\"\",D12)","v":""},{"$f":"IF(D13=\"\",\"\",D13)","v":""},{"$f":"IF(D14=\"\",\"\",D14)","v":""},{"$f":"IF(D15=\"\",\"\",D15)","v":""},{"$f":"IF(D16=\"\",\"\",D16)","v":""}]
["Möjliggör inomhusmiljöerna för varierad och personlig utformning, där barnen kan prägla verksamhetsytorna? Använd diskussionsfrågorna nedan för att svara på denna fråga:",null,"Ja: 1, nej: -1",null,false,false,false,false,false,false,false,false,false,false,null,{"$f":"IF(E110=TRUE,1,-1)","v":-1},{"$f":"IF(F110=TRUE,1,-1)","v":-1},{"$f":"IF(G110=TRUE,1,-1)","v":-1},{"$f":"IF(H110=TRUE,1,-1)","v":-1},{"$f":"IF(I110=TRUE,1,-1)","v":-1},-1,-1,-1,-1,-1]
["• Har verksamhetsrummen och tillhörande korridorer distinkta karakteristika, som exempelvis en varierad färgsättning, möblemang och dekoration? ","Personliga miljöer är bättre för att absorbera, memorera och återskapa information. Klassrum och övriga utrymmen med distinkta karaktärsdrag upplevs som mer familjära och trygga. Distinkta korridorer med landmärken, såsom utsikt eller inredningsinslag, ökar orienterbarheten. (Barrett et al 2015; Plotka 2016)"]
["• Finns det möjlighet för barnen att påverka och lämna avtryck i sin lärandemiljö?","Att få personalisera sin miljö, exempelvis genom att hänga upp egna alster,  kan öka barnens deltagande, samt ansvars- och trygghetskänsla. (Barrett et al 2015) "]
["• Har verksamhetsytorna en bra balans av färg och dekorativa inslag?","Golv, fondvägg, möblemang, inredning, färg och utsmyckning kan användas för att stimulera och är bra för lärandet. En riktlinje för att undvika överstimulans är att åtminstone 20 % av tillgänglig väggyta bör vara fri från visuella verk. De dekorativa inslagen bör även vara välordnade. (Barrett et al 2015; Plotka 2016)"]
[]
[]
[]
[]
["Upphöjda aktivitetsytor, gångar med fasta underlag, aktiviteter som skapar gemenskap","Olika behov - ålder, funktionsvariation, socioekonomiska perspektiv",null,null,null,"Gör som övergripande aspekt?"]
[]
["Personalisering, utsmyckning, samhällsanknytning , demokrati",null,"HCS-slutrapport, Isaksson et al",null,null,"Skolan ska förbereda barnen på att vara samhällsmedborgare"]
[]
["För vilka grupper? På bekostnad av vad? Vilkas behov kan glömmas bort?"]
[]
["Källor"]
["Barrett, P., Zhang, Y., Davies, F., Barrett, L.,  et al (2015) Clever Classrooms: Summary Report of the HEAD Project. Salford: Raw Engine House"]
["Boverket & Movium (2015) Gör plats för barn och unga! En vägledning för planering, utformning och förvaltning av skolans och förskolans utemiljö.Karlskrona: Boverket och Movium. "]
["Crawley, E. (2016) Play Value Factors: Inspiration for greener schoolgrounds with a child perspective. Molkom: EmmaJord. "]
["De Laval, S. (2010) Seminarium: Hur kan skolans arkitektur stödja lärandet? Stockholm: Arkitekturanalys"]
["Dempsey, N., Brown, C., & Bramley, G. (2012). The key to sustainable urban development in UK cities? The influence of density on social sustainability. Progress in Planning, 77(3), 89-141."]
["Folkhälsomyndigheten (2015) Inomhusmiljön i skolan: Ett nationellt tillsynsprojekt. Halmstad: Folkhälsomyndigheten"]
["Isaksson, E., Svantesson, A. S., Harri, M. (2013) Grönare skolgårdar i Vänersborg: Faktasammanställning, nulägesbeskrivning och förslag till åtgärder. "]
["Lenninger, A. (2014) Mått och steg: Resonemang kring ytbehov. S. de Laval (Red.) Skolans och förskolans utemiljöer: Kunskap och inspiration till stöd vid planering av barns utemiljö (s. 11-16). Stockholm: Skolhusgruppen"]
["Logan, Kerry (2016) Konferenspresentation: The Magic of Loose Parts. Lund: International School Grounds Alliance. "]
["Malmö Stad (2011a) Utemiljö vid förskolor i Malmo: Ett verktyg för planering, utformning och bygglovgranskning. Malmö: Malmö Stad"]
["Malmö Stad (2011b) Lekvärdesfaktor för förskolegårdar i Malmö: Med syfte att nå en hög lekkvalitet. Malmö: Malmö Stad "]
["Mårtensson, F. (2013) Vägledande miljödimensioner för barns utomhuslek. Socialmedicinsk tidskrift (4) 502-509. "]
["Nordström, M. (2014) Med eller utan skolgård: Gör det någon skillnad? S. de Laval (Red.) Skolans och förskolans utemiljöer: Kunskap och inspiration till stöd vid planering av barns utemiljö (s. 39-44). Stockholm: Skolhusgruppen"]
["Plotka, E. (2016) Better Spaces for Learning. London: Royal Institute of British Architects."]
["Pålsson, Emma (2010) Lekvärdefaktor: Inspiration till grönare skolgårdar med barnperspektiv. Malmö: Malmö Naturskola. "]
["SFS 2015:216 Förordning om trafikbuller vid bostadsbyggnader. Stockholm: Näringsdepartementet."]
["Statens folkhälsoinstitut (2013) Främja goda levnadsvanor genom åtgärder i livsmiljön: Planera och följ upp fysisk aktivitet. Östersund: Statens folkhälsoinstitut "]
["Szczepanski, A. (2014) Utomhusbaserat lärande och undervisning. S. de Laval (Red.) Skolans och förskolans utemiljöer: Kunskap och inspiration till stöd vid planering av barns utemiljö (s. 25-32). Stockholm: Skolhusgruppen"]
["Umeå Kommun (2017) Buller. Hämtad 2017-09-20, från http://www.umea.se/umeakommun/byggaboochmiljo/bullerochluftkvalitet/buller.4.24fd3c4512902bd549f800038.html   "]
["Westholm, H. & Rydsjö, P. (2015) Förskola, form, pedagogik: Erfarenheter från energieffektiva byggnader. Arkus och LÅGAN.  "]

{"sheet":"Defaultvärden","index":9,"n_rows":73,"n_cols":4,"rows_kept":73,"cut":false,"hidden":false,"merged":[]}
[null,"Defaultvärden"]
[null,"Föreslagna data att använda om specifika värden saknas"]
[]
[null,"Miljödata för fjärrvärme"]
[null,"Svenskt medelvärde:"]
[null,"Klimatpåverkan (Emission av växhusgaser)",83,"g CO2-ekv/kWh"]
[null,"Primärenergifaktor",0.79,"kWh/kWh"]
[null,"Använd lokala miljövärden för specifika fall!","https://www.energiforetagen.se/statistik/fjarrvarmestatistik/miljovardering-av-fjarrvarme/"]
[]
[]
[null,"Föreslagna praktiska livslängder (default i miljökalkyl)"]
[null,"Material/produkt","Livslängd, år"]
[]
[null,"Energisystem"]
[1,"Bergvärmepump",25]
[2,"Luft-vattenvärmepump",15]
[3,"Fjärrvärme",30]
[4,"Pelletspanna",25]
[5,"Oljepanna",25]
[6,"Elpanna",25]
[7,"Direktel"," - "]
[null,"Borrhål",100]
[null,"Fjärrvärmeanslutning",50]
[null,"Skorsten+pelletsförvaring",50]
[null,"Oljetank",50]
[]
[null,"Cirkulationspump oreglerad",15]
[null,"Cirkulationspump varvtalsreglerad",12.5]
[]
[null,"Ventilationsaggregat och frånluftsvärmepump",15]
[]
[null,"Solel",23]
[]
[null,"Isolering, fönster och dörrar"]
[null,"Isolering",40]
[null,"Fönster",40]
[null,"Dörr",40]
[null,"Fasadsystem",40]
[]
[null,"Byggmaterial"]
[null,"Trä: Konstruktionsvirke ",60]
[null,"Trä: Fasad (målad) ",60]
[null,"Trä: Invändig träpanel ",60]
[]
[null,"Betong: Bjälklag",80]
[null,"Betong: Bärande ytterväggar",80]
[null,"Betong: Icke bärande ytterväggar",80]
[null,"Betong: Innerväggare",80]
[]
[null,"Puts",40]
[null,"Gipsskiva",60]
[]
[1,"Takpannor av tegel",60]
[2,"Takpannor av betong",40]
[3,"Takpaneler av fibercement",30]
[4,"Takpapp",25]
[]
[null,"Distribution av energi, luft och vatten"]
[1,"Radiatorer - vattenburet",35]
[2,"Elradiatorer",22.5]
[]
[null,"Kopparrör",50]
[null,"PEX-rör",50]
[null,"PP-rör",50]
[null,"Gjutjärnsrör",50]
[null,"Galvaniserade stålrör",50]
[]
[null,"Relining",35]
[]
[null,"Ventilationskanaler",50]
[null,"Don och dämpare för ventilation",20]
[]
[null,"Elledningar",37.5]